program: Gaussian 09
title: 000219220
version: EM64L-G09RevD.01
frameworkgroup: C1[X(C14H14O2S)]
method: RPBEPBE
basis: SDD
operation: Freq
keyword: #p
keyword: freq=noraman
keyword: PBEPBE/SDD
title: #p freq=noraman PBEPBE/SDD
converged: NO YES NO NO
title: Mulliken charges:
elementType: S O O C C C C C C C C C C C C C C H H H H H H H H H H H H H H
charge: 0.896288 -0.548733 -0.548713 -0.774006 -0.061518 0.523698 -0.261326 -0.261320 0.448409 -0.364529 -0.364080 -0.347236 -0.347174 -0.218684 -0.218684 -0.799484 -0.227799 0.270321 0.270401 0.286302 0.286252 0.243079 0.243066 0.240096 0.240257 0.230206 0.230214 0.229108 0.229082 0.244754 0.231753
chargesum: 0.00000
title: Mulliken charges with hydrogens summed into heavy atoms:
elementType: S O O C C C C C C C C C C C C C C
charge: 0.896288 -0.548733 -0.548713 -0.233284 -0.061518 0.523698 0.024976 0.024932 0.448409 -0.121450 -0.121013 -0.107140 -0.106918 0.011522 0.011531 -0.096540 0.003954
polarizability: 3.04112585e+02 -6.02918970e-03 1.73267990e+02 1.03371467e+01 -7.13694660e-02 1.01559175e+02
1716.lowfreq: -46.1857 -12.4127 -3.4920 -2.9993 -0.0026 -0.0024 -0.0017 7.8501 31.0105
frequency: -45.6822 3.4131 30.8410 34.1222 47.5650 79.1757 126.8083 128.7191 185.4308 194.4309 218.6664 289.5744 293.5002 334.2890 342.3189 374.9715 401.4255 405.2693 407.7694 451.6987 503.5014 530.0757 568.0703 592.6382 615.4680 621.9228 692.8514 707.9169 768.0835 775.8859 793.0970 812.6870 829.3407 845.6129 852.3082 860.0136 925.5023 935.4172 962.9171 976.5367 980.9881 989.3026 990.9383 995.4346 998.3961 1026.2058 1048.6259 1052.0001 1073.7494 1114.1054 1121.9164 1175.5565 1181.8256 1186.0227 1194.4305 1217.8138 1235.0479 1293.6289 1330.4923 1380.4027 1388.4802 1389.3812 1399.1891 1420.5949 1442.8056 1471.0370 1471.9310 1474.0699 1484.1909 1589.5286 1594.4685 1595.2118 1611.3128 2981.0279 3056.8877 3063.3836 3091.8190 3129.2542 3133.0079 3134.2860 3135.7492 3145.8328 3147.8020 3155.4946 3156.4104 3158.8804 3169.8467
redmass: 1.0217 4.5698 3.7171 5.4892 4.6942 5.7425 6.2505 4.6730 5.7894 8.2449 8.2159 5.3497 4.5536 5.9356 2.0508 3.3252 2.7688 7.3913 2.8673 5.5087 3.3780 5.0657 4.2595 5.6928 6.3023 6.9575 1.6879 3.3532 2.3544 4.3273 6.9127 3.7771 1.4313 1.2701 1.2653 2.1514 1.4475 3.4923 1.2981 1.3980 1.3921 5.5192 1.3931 5.3146 1.3672 2.1919 1.5960 2.4987 1.4771 1.2461 1.1802 1.0531 1.1503 1.1601 1.1182 2.9511 2.8364 1.2671 1.2738 6.3392 4.3670 4.5463 1.2185 1.1740 2.2199 1.0980 2.3876 1.0574 2.3384 5.9551 6.9581 6.0272 5.9906 1.0388 1.0567 1.0949 1.1000 1.0849 1.0885 1.0888 1.0881 1.0927 1.1115 1.0955 1.0971 1.0970 1.1018
irintensity: 0.8794 0.3778 0.1213 1.2967 1.0900 4.2421 1.5841 0.3196 11.9214 0.0566 9.1164 5.6838 0.9591 10.6160 0.0574 0.0207 0.0236 44.5627 0.0025 36.0097 85.8128 7.3378 3.6365 33.5378 0.0016 0.2716 50.4580 0.6321 5.2863 16.9245 90.6060 18.2973 22.9635 0.0530 2.2484 16.0820 1.9225 44.6215 0.9282 0.0980 0.0818 0.6057 1.1718 4.4428 0.0141 5.4082 24.6271 27.1162 14.0625 3.1293 5.8160 0.0004 17.1946 10.1469 0.2000 7.6875 18.8000 2.7375 0.4023 0.0921 1.8270 9.1135 15.0514 5.4744 10.9570 16.8466 27.6762 13.6324 6.6366 0.7491 0.0128 6.4754 2.7240 27.7137 15.5408 19.2081 15.1543 1.2018 13.9380 7.4273 0.8016 18.7493 0.1899 1.4792 29.3598 16.8695 22.5425
temp: 298.150 k
press: 1.00000 atm
elementType: 16 8 8 6 6 6 6 6 6 6 6 6 6 6 6 6 6 1 1 1 1 1 1 1 1 1 1 1 1 1 1
symmnumber: 1
zpe: 628629.2 jmol-1
zpe.correction: 0.239432 hartree
zpe.thermalcorrener: 0.255358 hartree
zpe.thermalcorrenthalpy: 0.256302 hartree
zpe.thermalcorrgfe: 0.191882 hartree
zpe.sumelectzpe: -1089.022572 hartree
zpe.sumelectthermal: -1089.006647 hartree
zpe.sumelectthermalent: -1089.005702 hartree
zpe.sumelectthermalfe: -1089.070123 hartree
dipole: -2.8215 -0.0115 -4.9744
dipole: 5.7189
quadrupole: -75.2668 -101.7668 -120.0392
quadrupole: 0.0008 1.0640 -0.0288
quadrupole: 23.7574 -2.7425 -21.0149 0.0008 1.0640 -0.0288
hfenergy: -1089.2620045 hartree
pointgroup: C01 [X(C14H14O2S1)]
dipole: -1.0953817 0.0054069 1.9653391 debye
polarizability: 303.9465011|-0.0332122|173.2679488|-11.8519504|-0.0899305|101.7253002 unknown
InChI: InChI=1S/C14H14O2S/c1-12-7-9-14(10-8-12)17(15,16)11-13-5-3-2-4-6-13/h2-10H,11H2,1H3
charge 0 multiplicity 1
31 atoms
S  0.018465 -0.003459 -0.825931
O  0.318635 -1.443686 -1.551463
O  0.320583 1.433196 -1.557666
C  1.032321 -0.000665 0.926878
C  -1.805692 -0.001037 -0.313528
C  2.488651 -0.000282 0.647235
C  -2.452901 1.235352 -0.16036
C  -2.454643 -1.235765 -0.154311
C  -4.520688 0.002588 0.383321
C  -3.820286 1.224195 0.195235
C  -3.821987 -1.220922 0.201234
C  3.190536 1.22643 0.490918
C  3.191385 -1.226647 0.491917
C  4.571951 1.225354 0.207817
C  4.572783 -1.224825 0.208751
C  -5.998584 0.004367 0.729172
C  5.266948 0.000451 0.069731
H  0.63886 0.914028 1.394886
H  0.639672 -0.914649 1.39695
H  -1.910999 2.169292 -0.343978
H  -1.914089 -2.171369 -0.333367
H  -4.351212 2.174933 0.320546
H  -4.354256 -2.170288 0.331217
H  2.648242 2.174344 0.5802
H  2.649722 -2.174853 0.581903
H  5.105469 2.174422 0.088116
H  5.106946 -2.173617 0.089742
H  -6.280332 -0.886452 1.316946
H  -6.280248 0.900788 1.308377
H  -6.616003 -0.000056 -0.189916
H  6.340149 0.000733 -0.151173
