program: Gaussian 09
title: 000219215
version: EM64L-G09RevD.01
frameworkgroup: C1[X(C16H18O3)]
method: RPBEPBE
basis: SDD
operation: Freq
keyword: #pfreq=noraman
keyword: PBEPBE/SDD
title: #p freq=noraman PBEPBE/SDD
converged: YES YES NO NO
title: Mulliken charges:
elementType: O O O C C C C C C C C C C C C C C C C H H H H H H H H H H H H H H H H H H
charge: -0.304851 -0.448414 -0.472180 0.430908 0.449518 -0.199935 -0.188843 0.331161 0.331275 -0.422445 -0.394907 -0.372545 -0.369729 -0.382426 -0.393609 -0.357093 -0.355206 -0.680599 -0.702574 0.197127 0.202672 0.235496 0.231807 0.266820 0.282840 0.256450 0.255020 0.266508 0.264582 0.231880 0.214816 0.235493 0.241277 0.230083 0.205992 0.338689 0.344942
chargesum: 0.00000
title: Mulliken charges with hydrogens summed into heavy atoms:
elementType: O O O C C C C C C C C C C C C C C C C
charge: -0.304851 -0.109725 -0.127238 0.430908 0.449518 -0.002808 0.013829 0.331161 0.331275 -0.186949 -0.163099 -0.105725 -0.086889 -0.125977 -0.138589 -0.090585 -0.090624 0.001590 -0.025222
polarizability: 2.83884276e+02 -1.17207307e+00 1.63750815e+02 1.60999324e+01 2.16052775e+00 1.25640773e+02
1716.lowfreq: -9.2322 -4.4176 0.0005 0.0009 0.0010 2.4046 19.0954 23.8700 35.0311
frequency: 18.8892 23.8604 35.0214 41.1880 65.6815 93.6205 101.9253 163.0346 197.8331 201.7879 227.5441 231.6885 247.5198 260.5697 271.9265 321.0874 343.1060 360.1301 377.0944 406.6923 410.9199 414.8412 421.7682 454.6746 500.6126 510.9452 537.9872 573.8562 596.0514 626.3323 632.0439 689.9653 726.5158 735.8500 741.4183 784.6609 829.5396 832.4871 836.3750 853.8359 856.2016 870.9568 874.1303 949.8706 951.7391 969.5730 981.7069 984.5725 996.8060 1005.1030 1008.4364 1053.0703 1057.2686 1075.1175 1077.5770 1112.4538 1114.6004 1148.5866 1156.7253 1170.9877 1187.3783 1200.9194 1219.4157 1229.6092 1240.6687 1285.7344 1297.0462 1299.3150 1313.3227 1346.7168 1365.6536 1382.5956 1386.8555 1387.7845 1392.1993 1409.1524 1415.4747 1458.7690 1464.9642 1467.2192 1471.7903 1489.3792 1498.0776 1584.2595 1595.1935 1611.7873 1623.7380 2937.5501 2939.1028 2974.4549 2994.6639 3068.0950 3095.1296 3098.1306 3100.4925 3120.4618 3122.4088 3139.0149 3151.5540 3162.7864 3167.7324 3168.3943 3178.7269 3553.3749 3572.7226
redmass: 4.1309 3.3855 5.4670 3.6222 3.6304 4.6060 4.7882 4.4788 3.2217 3.5324 2.3042 1.2788 3.5493 1.5069 1.1230 3.1529 3.8427 1.3911 3.0430 3.6587 3.3620 3.0368 4.2818 3.5097 3.8125 3.8005 2.6787 4.3809 3.2400 6.1141 6.7761 4.2641 3.8511 3.2798 3.5021 4.5645 1.2839 1.4422 1.4702 1.7386 3.2783 2.7619 2.7743 1.3452 1.3522 1.3512 1.3326 2.2559 2.1631 2.6556 2.5092 1.6484 2.0800 1.8732 2.1814 1.3333 1.3155 1.9509 1.6156 1.2212 1.4397 1.9507 2.3440 2.0041 1.2961 1.3913 1.2851 1.2561 1.3954 1.6628 2.5647 2.3010 1.3106 1.2663 3.5132 3.4104 3.0528 1.0580 1.0654 1.0924 1.0665 2.3898 2.5980 7.1590 7.4050 6.3692 6.6016 1.0839 1.0847 1.0375 1.0349 1.0974 1.1002 1.1000 1.1008 1.0896 1.0896 1.0881 1.0894 1.0953 1.0948 1.0953 1.0952 1.0659 1.0662
irintensity: 1.1701 1.2006 0.2510 4.4032 0.0931 0.9817 1.6183 4.5971 0.7566 1.7964 8.1167 10.8832 6.5836 2.5262 131.9389 38.0263 13.9000 163.3696 15.8740 1.6767 6.2853 0.8575 7.7585 7.5290 2.5265 21.0987 38.7861 20.8803 2.7213 1.9612 1.6937 1.7216 6.1347 1.4921 0.7500 1.5872 13.0429 51.3214 45.6997 18.8375 43.4827 36.7848 31.3774 0.3177 0.6281 1.3351 0.5863 36.3804 17.5436 15.3685 6.5018 41.0987 98.3950 47.9244 11.1153 9.1691 6.5865 25.1082 32.2037 78.1032 1.0267 28.2544 333.8759 143.0866 56.0478 35.8653 1.6015 10.6076 2.7279 49.8515 33.6713 7.7692 18.0513 23.3810 3.9382 5.9202 4.0084 4.2917 19.1017 4.2218 14.6662 288.4297 44.1026 5.1367 4.5310 105.5083 0.3260 52.4303 57.8020 41.3478 18.9366 49.5776 21.0379 22.9274 40.8442 24.0072 19.0629 6.8485 7.4240 5.8898 5.0419 5.3412 1.1975 6.3894 4.2612
temp: 298.150 k
press: 1.00000 atm
elementType: 8 8 8 6 6 6 6 6 6 6 6 6 6 6 6 6 6 6 6 1 1 1 1 1 1 1 1 1 1 1 1 1 1 1 1 1 1
symmnumber: 1
zpe: 785265.7 jmol-1
zpe.correction: 0.299092 hartree
zpe.thermalcorrener: 0.317792 hartree
zpe.thermalcorrenthalpy: 0.318736 hartree
zpe.thermalcorrgfe: 0.249997 hartree
zpe.sumelectzpe: -844.759188 hartree
zpe.sumelectthermal: -844.740488 hartree
zpe.sumelectthermalent: -844.739544 hartree
zpe.sumelectthermalfe: -844.808282 hartree
dipole: 2.5324 0.1849 1.0425
dipole: 2.7448
quadrupole: -90.0235 -112.0229 -113.5561
quadrupole: -13.1691 11.9123 2.2638
quadrupole: 15.1773 -6.8220 -8.3552 -13.1691 11.9123 2.2638
hfenergy: -845.0582798 hartree
pointgroup: C01 [X(C16H18O3)]
dipole: 0.9915947 0.036372 0.4261237 debye
polarizability: 283.3978443|-3.5686097|163.4118385|17.9994326|4.2322111|126.4661811 unknown
InChI: InChI=1S/C16H18O3/c1-11(17)13-3-7-15(8-4-13)19-16-9-5-14(6-10-16)12(2)18/h3-12,17-18H,1-2H3
charge 0 multiplicity 1
37 atoms
O  0.008579 1.639391 0.021025
O  -5.548108 -1.462698 1.211641
O  5.265938 -1.798762 -1.213925
C  -3.828471 -0.177888 -0.042249
C  3.809901 -0.251128 -0.062678
C  -5.21868 -0.805731 -0.074873
C  5.188974 -0.90023 -0.04616
C  -1.23233 0.958337 -0.023169
C  1.239406 0.930549 0.008072
C  -3.595203 1.102667 -0.601141
C  3.576883 0.926888 0.689809
C  -2.737921 -0.872981 0.541746
C  2.737973 -0.817371 -0.793185
C  -2.304514 1.672467 -0.600689
C  2.297888 1.519098 0.733213
C  -1.443421 -0.315086 0.559544
C  1.454009 -0.231355 -0.767775
C  -5.357471 -1.911765 -1.132818
C  5.445786 -1.684996 1.262164
H  -5.965104 -0.007736 -0.284736
H  5.960341 -0.104064 -0.143077
H  -4.428376 1.661952 -1.044775
H  4.399601 1.393365 1.246206
H  -2.915733 -1.853359 0.997607
H  2.930335 -1.704973 -1.401594
H  -2.11289 2.660841 -1.028578
H  2.106916 2.430446 1.30733
H  -0.612811 -0.852367 1.02754
H  0.637538 -0.662533 -1.355516
H  -4.633345 -2.720752 -0.933805
H  -5.165309 -1.509253 -2.142759
H  -6.375291 -2.337129 -1.102169
H  4.710938 -2.502814 1.362631
H  5.351748 -1.024929 2.142928
H  6.464718 -2.11934 1.272452
H  -5.390591 -0.81499 1.945574
H  6.110494 -2.312969 -1.167014
