program: Gaussian 09
title: 000219211
version: EM64L-G09RevD.01
frameworkgroup: C1[X(C15H12N2O5)]
method: RPBEPBE
basis: SDD
operation: Freq
keyword: #p
keyword: freq=noraman
keyword: PBEPBE/SDD
title: #p freq=noraman PBEPBE/SDD
converged: YES YES NO NO
title: Mulliken charges:
elementType: O O O O O N N C C C C C C C C C C C C C C C H H H H H H H H H H H H
charge: -0.290990 -0.431080 -0.431081 -0.315166 -0.315165 -0.509023 -0.509022 0.343974 0.343971 0.032919 0.032920 -0.317714 -0.317713 0.228779 -0.298224 -0.298224 -0.215286 -0.215287 -0.248207 -0.248207 0.159738 0.159738 0.380901 0.380902 0.314959 0.314960 0.275800 0.275800 0.232536 0.232536 0.235328 0.235328 0.389649 0.389649
chargesum: 0.00000
title: Mulliken charges with hydrogens summed into heavy atoms:
elementType: O O O O O N N C C C C C C C C C C C C C C C
charge: -0.290990 -0.041431 -0.041432 -0.315166 -0.315165 -0.128121 -0.128121 0.343974 0.343971 0.032919 0.032920 -0.002754 -0.002752 0.228779 -0.022424 -0.022424 0.017250 0.017248 -0.012878 -0.012879 0.159738 0.159738
polarizability: 3.53847359e+02 3.20895609e-05 2.42885603e+02 -1.04389503e-01 1.43534559e-03 7.43721191e+01
1716.lowfreq: -0.0010 -0.0008 -0.0007 3.7232 8.3523 10.4843 19.8572 35.6773 56.4186
frequency: 19.5349 35.4905 56.4186 71.0733 71.7257 113.1995 122.8761 145.7347 146.7695 160.4419 178.3262 256.0815 266.6339 273.6723 284.8483 328.2812 337.9711 392.8715 418.3442 421.1065 422.2759 488.7379 516.7066 525.2915 528.2694 542.1949 580.8845 582.6102 603.2367 606.9665 629.7618 685.6884 686.7592 711.1686 711.4021 752.7495 753.6495 762.1101 786.6575 786.8539 789.4399 820.8163 839.6715 883.0255 902.7870 904.3003 936.7314 981.6661 982.0083 998.4102 1009.6828 1010.8645 1014.2626 1022.4930 1042.5442 1045.0672 1110.3534 1121.1051 1163.7003 1165.8084 1177.6911 1178.9974 1211.2003 1244.1245 1254.4623 1303.0332 1321.3803 1328.0244 1335.5947 1389.7468 1390.0231 1438.3023 1442.2801 1464.9712 1465.8284 1514.7935 1529.9935 1581.5501 1584.4495 1595.7870 1595.8094 1630.9697 1638.0915 1682.6784 3137.6170 3137.6699 3159.1638 3159.2085 3181.7176 3181.7556 3187.4652 3197.3293 3197.3710 3211.7144 3530.9376 3531.2056
redmass: 6.6712 6.5849 7.4035 9.0594 10.6539 4.5672 5.7911 7.8318 6.5353 6.0431 6.5535 4.9577 5.6107 7.3879 5.0286 8.0032 12.6201 10.2159 8.6389 3.1728 3.2056 7.0412 6.3833 3.1608 3.2912 7.4701 1.2009 1.2038 5.1866 5.0729 6.5739 4.3479 4.4294 8.8173 5.5290 2.4559 5.6893 2.6557 6.0433 1.5400 1.7235 6.2373 1.2621 6.3430 1.3985 1.3848 1.1272 1.3624 1.3620 6.5264 1.3159 1.3118 5.3761 5.9214 2.2225 2.0840 1.8977 1.7133 1.6358 1.6012 1.1542 1.1137 3.0201 1.7233 1.6946 1.9229 2.0872 2.8230 2.7775 9.2204 9.2525 2.6010 2.6263 2.7879 2.6926 2.8252 3.4495 6.9509 6.8315 5.5668 3.1639 7.6036 3.6297 1.8533 1.0877 1.0877 1.0922 1.0921 1.0969 1.0969 1.0839 1.0946 1.0947 1.0825 1.0641 1.0641
irintensity: 0.0000 1.8277 0.6483 0.0000 1.1761 0.0000 3.2368 11.3836 0.1426 0.0000 0.1038 7.1483 5.0209 0.3735 0.0000 4.2115 0.2191 0.0636 7.8696 0.0000 25.7375 40.8800 3.6945 0.0002 16.2797 1.1822 0.0005 225.7557 23.9535 84.2820 0.5974 0.0004 105.2595 0.0012 1.2165 0.0006 0.9323 78.1793 17.3321 0.0060 86.5308 1.5403 0.0005 0.4912 0.0000 5.4561 204.3533 0.0000 7.8332 73.5507 0.0010 8.5009 223.9915 277.4444 62.9759 12.5423 149.5208 194.1083 161.3177 173.2559 0.2197 1.7539 298.9782 6.5423 21.2897 398.4287 23.0533 562.3068 175.4680 13.3395 45.4204 83.9788 5.5609 56.8325 26.6132 1471.1897 16.3700 368.7772 16.8314 191.2004 309.8391 223.0087 23.6794 19.9651 0.6497 16.5784 15.3600 14.0992 17.2545 2.9359 141.7547 16.1227 2.4347 312.0370 14.0134 122.3935
temp: 298.150 k
press: 1.00000 atm
elementType: 8 8 8 8 8 7 7 6 6 6 6 6 6 6 6 6 6 6 6 6 6 6 1 1 1 1 1 1 1 1 1 1 1 1
symmnumber: 1
zpe: 655691.5 jmol-1
zpe.correction: 0.249740 hartree
zpe.thermalcorrener: 0.268215 hartree
zpe.thermalcorrenthalpy: 0.269159 hartree
zpe.thermalcorrgfe: 0.201546 hartree
zpe.sumelectzpe: -1062.945965 hartree
zpe.sumelectthermal: -1062.927490 hartree
zpe.sumelectthermalent: -1062.926546 hartree
zpe.sumelectthermalfe: -1062.994158 hartree
dipole: 0.0000 1.4888 0.0008
dipole: 1.4888
quadrupole: -99.8042 -111.2592 -131.5131
quadrupole: 0.0000 -0.0102 -0.0001
quadrupole: 14.3880 2.9330 -17.3209 0.0000 -0.0102 -0.0001
hfenergy: -1063.1957045 hartree
pointgroup: C01[X(C15H12N2O5)]
dipole: 0.000054 -0.5857545 0.0002854 debye
polarizability: 353.833656|0.0136161|242.885604|-1.9596013|0.0072898|74.3858213 unknown
InChI: InChI=1S/C15H12N2O5/c18-13(19)9-5-1-3-7-11(9)16-15(22)17-12-8-4-2-6-10(12)14(20)21/h1-8,16-18,20H
charge 0 multiplicity 1
34 atoms
O  -0.00078 2.17437 -0.000126
O  -4.324673 -2.737671 0.038184
O  4.324315 -2.736607 -0.038554
O  -2.042631 -2.394161 0.020215
O  2.042186 -2.393667 -0.020888
N  -1.156803 0.10743 0.008796
N  1.155737 0.10771 -0.008872
C  -2.49496 0.537969 0.017489
C  2.493789 0.538576 -0.017465
C  -3.541147 -0.459369 0.027218
C  3.540223 -0.458504 -0.027072
C  -2.865903 1.914223 0.016938
C  2.864392 1.914923 -0.016891
C  -0.00063 0.907243 -0.00012
C  -4.904783 -0.051764 0.035711
C  4.903759 -0.050561 -0.035418
C  -4.222661 2.281725 0.025444
C  4.22106 2.28276 -0.025243
C  -5.253184 1.306963 0.034855
C  5.251825 1.308252 -0.034519
C  -3.212953 -1.893221 0.02844
C  3.212387 -1.892436 -0.028374
H  -1.062327 -0.929385 0.010127
H  1.061512 -0.929129 -0.010048
H  -2.076003 2.666293 0.009918
H  2.074303 2.666795 -0.009962
H  -5.673851 -0.828526 0.042932
H  5.673018 -0.827134 -0.042557
H  -4.480565 3.346864 0.024731
H  4.478701 3.347963 -0.024509
H  -6.304925 1.609003 0.041412
H  6.303492 1.610551 -0.040953
H  -4.003467 -3.67908 0.037652
H  4.003342 -3.678096 -0.038495
