program: Gaussian 09
title: 000219207
version: EM64L-G09RevD.01
frameworkgroup: C1[X(C14H11NO)]
method: RPBEPBE
basis: SDD
operation: Freq
keyword: #p
keyword: freq=noraman
keyword: PBEPBE/SDD
title: #p freq=noraman PBEPBE/SDD
converged: YES YES NO NO
title: Mulliken charges:
elementType: O N C C C C C C C C C C C C C C H H H H H H H H H H H
charge: -0.250029 -0.057878 0.295345 0.096248 -0.337624 -0.350773 0.183307 -0.274190 -0.252031 -0.248642 -0.232173 -0.227203 -0.301975 -0.196118 -0.171749 -0.368118 0.228916 0.279601 0.258656 0.268726 0.230113 0.231925 0.232015 0.242423 0.243027 0.234835 0.243367
chargesum: 0.00000
title: Mulliken charges with hydrogens summed into heavy atoms:
elementType: O N C C C C C C C C C C C C C C
charge: -0.250029 -0.057878 0.295345 0.096248 -0.108708 -0.071172 0.183307 -0.015534 0.016694 -0.018528 -0.000248 0.004812 -0.059552 0.046909 0.063086 -0.124751
polarizability: 3.20787739e+02 -8.95855752e-01 1.66421581e+02 -1.97142889e-01 -4.39636130e-02 6.07965057e+01
1716.lowfreq: -5.3775 -0.0004 0.0003 0.0007 2.0305 3.6830 19.9525 34.1257 54.8661
frequency: 19.6747 34.1251 54.8616 87.0716 125.1839 182.9882 189.4613 219.3005 254.4558 303.1788 400.1827 402.9468 418.9581 439.3115 502.8352 510.2856 587.6163 613.4458 617.3225 668.0005 674.9598 696.1063 743.8478 775.2785 794.5256 806.9756 857.1865 880.3998 897.0024 920.5720 945.8797 962.7100 964.0034 989.1127 991.0279 998.8060 1008.5393 1010.2471 1012.6650 1031.3518 1038.9052 1085.3600 1091.7578 1166.6958 1172.4329 1184.3624 1196.7903 1224.0222 1292.7024 1298.0327 1307.9159 1328.8997 1338.2918 1386.6461 1411.3368 1433.4917 1453.8762 1480.3587 1520.1360 1554.8321 1573.7029 1587.9480 1608.8427 1642.6266 3115.0170 3126.3769 3127.8457 3139.2921 3139.6763 3151.3234 3155.0128 3159.9373 3166.9403 3173.4794 3174.6982
redmass: 3.7579 5.0653 5.3611 6.1315 4.0938 5.0649 3.3914 7.3074 3.2682 6.5270 2.7799 3.3495 6.8191 3.4603 2.8174 5.0454 7.2654 6.4710 7.1726 6.5150 3.9240 1.5658 1.7407 1.7531 6.5349 2.5421 1.2566 4.0992 1.3717 1.8510 1.4761 1.4626 6.5884 6.1353 1.3576 1.2872 1.2055 4.1886 1.3266 2.0190 2.3076 1.6355 1.6143 1.0782 1.0665 1.2052 1.2277 3.1043 1.5452 4.5399 1.5628 2.1470 1.8594 8.8436 1.9426 2.3221 2.3492 2.2406 9.5550 5.2691 5.7401 6.1648 6.0206 6.1944 1.0907 1.0890 1.0852 1.0886 1.0887 1.0927 1.0944 1.0953 1.0966 1.1014 1.0937
irintensity: 0.0508 4.2199 1.7336 0.0179 1.9421 1.6173 0.2162 1.0187 1.7788 8.1998 0.0573 4.4616 0.4998 0.7863 10.7072 7.5571 43.5137 0.4128 1.1913 7.9523 4.8607 63.6540 20.8397 106.8896 6.7752 0.1179 0.9553 2.5944 0.3383 0.9413 0.4758 0.0486 4.0968 1.5756 9.3388 10.1783 31.9793 59.2953 7.3214 2.9564 5.5447 8.6937 6.0221 2.7493 5.5783 35.2447 17.0541 154.5495 3.4070 84.3142 40.0910 38.3238 161.0988 5.1765 43.5679 15.5651 52.9529 4.7213 133.6352 32.2140 33.2645 10.0826 41.7857 133.8083 0.9310 19.3193 0.1248 9.6236 2.8068 18.0071 21.0630 12.9391 30.5870 24.4517 11.3400
temp: 298.150 k
press: 1.00000 atm
elementType: 8 7 6 6 6 6 6 6 6 6 6 6 6 6 6 6 1 1 1 1 1 1 1 1 1 1 1
symmnumber: 1
zpe: 547901.4 jmol-1
zpe.correction: 0.208685 hartree
zpe.thermalcorrener: 0.221829 hartree
zpe.thermalcorrenthalpy: 0.222773 hartree
zpe.thermalcorrgfe: 0.166480 hartree
zpe.sumelectzpe: -668.948171 hartree
zpe.sumelectthermal: -668.935026 hartree
zpe.sumelectthermalent: -668.934082 hartree
zpe.sumelectthermalfe: -668.990376 hartree
dipole: 2.4499 2.1201 -0.0006
dipole: 3.2399
quadrupole: -57.4495 -89.7541 -98.8077
quadrupole: -6.1241 -0.0659 -0.0442
quadrupole: 24.5542 -7.7503 -16.8040 -6.1241 -0.0659 -0.0442
hfenergy: -669.1568557 hartree
pointgroup: C01 [X(C14H11N1O1)]
dipole: 0.9646338 -0.8308587 0.0624693 debye
polarizability: 320.7443509|1.2509347|166.0276168|3.2168327|-6.4536298|61.2338576 unknown
InChI: InChI=1S/C14H11NO/c16-14(12-6-2-1-3-7-12)10-9-13-8-4-5-11-15-13/h1-11H
charge 0 multiplicity 1
27 atoms
O  -1.194255 2.272009 -0.174908
N  2.686475 -1.081941 0.065736
C  -2.457957 0.220661 -0.068656
C  -1.168788 0.997393 -0.099385
C  -2.518589 -1.197013 0.028904
C  -3.673383 0.956645 -0.139961
C  2.634636 0.29532 -0.010791
C  0.125195 0.265073 -0.041792
C  1.314741 0.9387 -0.06265
C  -3.765685 -1.858395 0.054298
C  -4.916373 0.296811 -0.115273
C  -4.966679 -1.115711 -0.017727
C  3.816071 1.088206 -0.040724
C  5.077392 0.457631 0.008951
C  5.130818 -0.952068 0.087648
C  3.908528 -1.67152 0.112772
H  -1.603775 -1.794231 0.086615
H  -3.605354 2.047112 -0.213776
H  0.152218 -0.826518 0.016934
H  1.28537 2.035462 -0.122229
H  -3.800861 -2.950707 0.130038
H  -5.844957 0.87539 -0.17129
H  -5.933154 -1.631928 0.002001
H  3.734398 2.178695 -0.101782
H  5.996816 1.051765 -0.013054
H  6.085263 -1.485821 0.128673
H  3.90879 -2.766321 0.173529
