program: Gaussian 09
title: 000219192
version: EM64L-G09RevD.01
frameworkgroup: C1[X(C15H20O3)]
method: RPBEPBE
basis: SDD
operation: Freq
keyword: #pfreq=noraman
keyword: PBEPBE/SDD
title: #p freq=noraman PBEPBE/SDD
converged: YES YES NO NO
title: Mulliken charges:
elementType: O O O C C C C C C C C C C C C C C C H H H H H H H H H H H H H H H H H H H H
charge: -0.434840 -0.262503 -0.425343 -0.353138 -0.402915 -0.341271 -0.512919 -0.356430 0.279167 -0.696135 -0.413026 0.450918 0.066017 -0.349993 -0.355639 -0.364416 -0.403536 0.283707 0.183810 0.203301 0.229045 0.198783 0.186218 0.182590 0.230590 0.203074 0.194242 0.195414 0.214235 0.209876 0.208987 0.257948 0.239237 0.240732 0.254613 0.224062 0.376735 0.358804
chargesum: 0.00000
title: Mulliken charges with hydrogens summed into heavy atoms:
elementType: O O O C C C C C C C C C C C C C C C
charge: -0.058105 -0.262503 -0.066539 0.033972 0.024913 0.027537 -0.079255 0.033226 0.279167 -0.063037 -0.155078 0.450918 0.066017 -0.110756 -0.114907 -0.109803 -0.179473 0.283707
polarizability: 2.38536413e+02 -6.62872524e+01 1.74250374e+02 7.48943355e+00 1.74376287e+00 1.56134677e+02
1716.lowfreq: -22.5193 -8.6405 0.0005 0.0006 0.0006 6.7845 7.5044 24.7140 35.4009
frequency: -17.9766 24.0444 35.2146 41.6186 61.4256 67.3361 85.3834 115.7061 117.2652 120.1120 180.2711 203.5575 227.0305 229.0829 277.7653 292.5418 322.5829 350.5638 369.8183 376.5884 397.7107 415.0827 439.5115 484.7809 504.5121 522.8221 553.8930 597.9502 619.9326 639.8006 709.3039 714.1003 725.6434 746.2018 764.1471 772.0576 809.0114 826.2959 837.2747 843.6252 861.8825 888.2426 929.8533 945.2261 956.0427 963.1778 999.3379 1000.9396 1013.4790 1025.7716 1052.4496 1070.2132 1083.4406 1107.8248 1109.3791 1143.9602 1155.5890 1183.8967 1197.9359 1204.2694 1231.9813 1249.8184 1256.5508 1261.1664 1281.6420 1287.3904 1300.8704 1306.5450 1312.8037 1333.2381 1344.2667 1352.8157 1375.7580 1388.6052 1403.9400 1432.5199 1461.1321 1462.9303 1464.2464 1471.7996 1476.5501 1480.8506 1487.6187 1500.4402 1583.2813 1595.0501 1623.0703 1642.6427 2950.2277 2957.4081 2966.6850 2970.9519 2975.9118 2989.2827 3008.6784 3013.5446 3028.0189 3048.9909 3067.4485 3069.7622 3081.3575 3091.5711 3115.7352 3142.4492 3158.6699 3179.6402 3521.3168 3579.8731
redmass: 3.7386 3.1998 1.8487 4.3867 6.0095 7.2932 3.2397 2.6615 2.9001 3.1369 3.7764 3.7443 1.1610 4.4854 3.8773 3.6205 3.1501 3.5735 2.8289 1.2651 3.6236 3.0027 2.9905 3.3898 6.1792 2.7442 2.4397 2.9107 1.8513 4.3387 2.4216 2.5255 1.2200 3.0016 1.5183 5.5159 1.3627 2.7032 1.6632 1.6426 2.3157 1.8301 1.3761 1.3647 1.4907 1.3522 2.1269 2.8009 2.7608 3.5672 1.8519 2.3079 2.2179 1.5104 1.9924 1.3632 1.8162 1.1247 1.5126 1.4073 1.8501 1.3652 2.0892 1.4324 1.0471 1.1977 1.9379 1.3968 1.3198 1.4676 1.4993 1.6273 2.7492 1.2184 2.2559 3.1118 1.0964 1.0716 1.0890 1.0751 1.0428 1.0780 1.0868 2.6797 6.2147 7.4657 6.3843 7.9342 1.0589 1.0600 1.0591 1.0367 1.0641 1.0963 1.0982 1.0651 1.1023 1.1020 1.1007 1.0992 1.0871 1.0962 1.0880 1.0964 1.0878 1.0967 1.0640 1.0660
irintensity: 0.0319 0.7540 0.0517 0.5080 0.6041 0.5221 0.1976 0.9998 0.1641 1.6661 0.0805 0.4660 0.0110 0.3494 2.4877 0.2813 2.2926 0.2875 19.3710 125.6965 22.4657 1.9047 8.5949 2.3719 50.3848 30.6318 49.3678 26.7120 64.9376 16.3475 33.3547 1.9788 10.2495 3.2773 4.7706 9.7356 22.9409 15.8433 21.6965 33.2123 23.1861 1.6894 11.7752 0.5540 19.2611 1.4569 72.1150 11.7426 3.3334 134.7698 345.5714 0.9229 42.3423 56.4697 11.2827 281.5852 33.7163 11.5926 7.1616 8.7236 3.2584 1.5961 51.6049 12.1667 0.3418 7.9937 6.7208 38.5499 24.7104 22.7623 2.2592 4.0131 4.1202 12.2469 11.5591 1.1025 12.1913 0.4825 1.7757 1.7615 11.7073 5.3675 21.5591 117.4354 61.3415 369.6659 53.3107 60.9260 5.7614 6.4015 60.0301 35.1257 80.5602 4.7656 3.8153 23.9706 24.5704 48.7276 90.9519 48.7908 0.5153 23.7006 17.1401 13.6701 5.2327 6.2505 48.9913 71.5521
temp: 298.150 k
press: 1.00000 atm
elementType: 8 8 8 6 6 6 6 6 6 6 6 6 6 6 6 6 6 6 1 1 1 1 1 1 1 1 1 1 1 1 1 1 1 1 1 1 1 1
symmnumber: 1
zpe: 829021.2 jmol-1
zpe.correction: 0.315758 hartree
zpe.thermalcorrener: 0.334108 hartree
zpe.thermalcorrenthalpy: 0.335053 hartree
zpe.thermalcorrgfe: 0.267388 hartree
zpe.sumelectzpe: -807.900719 hartree
zpe.sumelectthermal: -807.882368 hartree
zpe.sumelectthermalent: -807.881424 hartree
zpe.sumelectthermalfe: -807.949089 hartree
dipole: -1.2627 1.8968 -0.0878
dipole: 2.2803
quadrupole: -97.7228 -112.0126 -106.3655
quadrupole: -9.1598 10.3781 -9.2667
quadrupole: 7.6442 -6.6456 -0.9986 -9.1598 10.3781 -9.2667
hfenergy: -808.2164765 hartree
pointgroup: C01 [X(C15H20O3)]
dipole: -0.4243925 0.7899382 -0.0277557 debye
polarizability: 224.4866828|-71.3774921|186.8740632|9.7226215|-3.6740459|157.5607179 unknown
InChI: InChI=1S/C15H20O3/c1-2-3-4-5-6-13(15(17)18)11-12-7-9-14(16)10-8-12/h7-11,16-17H,2-6H2,1H3
charge 0 multiplicity 1
38 atoms
O  2.193287 -3.456669 0.323634
O  1.175314 -3.335906 -1.752883
O  -4.766593 2.478908 0.0355
C  2.093468 0.795927 0.624557
C  2.171967 -0.524122 1.422539
C  3.405988 1.611094 0.676972
C  0.837861 -1.332562 1.433738
C  3.339449 2.922053 -0.139244
C  0.430836 -1.827439 0.055143
C  4.649191 3.737865 -0.079797
C  -0.593566 -1.361806 -0.742195
C  -1.653734 -0.375369 -0.487054
C  1.257388 -2.900552 -0.573767
C  -2.232685 -0.100417 0.79002
C  -2.192975 0.317151 -1.611792
C  -3.263633 0.841908 0.940495
C  -3.212646 1.276876 -1.474618
C  -3.745294 1.544981 -0.189541
H  1.26072 1.415934 1.018608
H  1.842148 0.57747 -0.433132
H  2.983217 -1.161776 1.023924
H  2.438223 -0.297946 2.475328
H  4.242375 0.986791 0.297923
H  3.651532 1.850219 1.73323
H  0.959585 -2.196546 2.113153
H  0.055803 -0.682671 1.857021
H  2.498729 3.541272 0.235377
H  3.099662 2.679846 -1.194775
H  4.574324 4.670592 -0.668905
H  5.49895 3.152857 -0.479904
H  4.895981 4.015321 0.962627
H  -0.609211 -1.792528 -1.755762
H  -1.909724 -0.664173 1.669126
H  -1.790087 0.104524 -2.609069
H  -3.716348 1.03937 1.916492
H  -3.595762 1.803666 -2.358087
H  2.687504 -4.174896 -0.156142
H  -5.045242 2.914152 -0.808441
