program: Gaussian 09
title: 000019350
version: EM64L-G09RevD.01
frameworkgroup: C1[X(C17H16)]
method: RPBEPBE
basis: SDD
operation: Freq
keyword: #p
keyword: freq=noraman
keyword: PBEPBE/SDD
title: #p freq=noraman PBEPBE/SDD
converged: NO YES NO NO
title: Mulliken charges:
elementType: C C C C C C C C C C C C C C C C C H H H H H H H H H H H H H H H H
charge: 0.224944 0.095322 0.450969 0.430094 -0.571701 0.364721 0.310639 0.370959 -0.722215 -0.515779 -0.483283 -0.457875 -0.434246 -0.875447 -0.260238 -0.824667 -0.819151 0.241316 0.239875 0.239953 0.233985 0.239541 0.223653 0.235242 0.236449 0.235266 0.228389 0.225005 0.230111 0.224992 0.232022 0.225565 0.225591
chargesum: 0.00000
title: Mulliken charges with hydrogens summed into heavy atoms:
elementType: C C C C C C C C C C C C C C C C C
charge: 0.224944 0.095322 0.450969 0.430094 -0.330385 0.364721 0.310639 0.370959 -0.482340 -0.275826 -0.249298 -0.218334 -0.210593 -0.168490 -0.031849 -0.144559 -0.135974
polarizability: 3.07086620e+02 6.70629997e-01 2.03162609e+02 5.54668311e-03 -2.98858585e-03 8.42305682e+01
1716.lowfreq: -10.5806 -6.4725 -1.5643 -0.0006 0.0005 0.0005 8.4746 66.1068 99.4428
frequency: -9.2705 66.0868 99.2240 132.8365 159.8153 174.5991 177.9258 223.9968 281.6460 287.3518 309.2704 323.9532 334.9119 355.4728 413.9327 434.3390 468.4283 480.7506 505.9754 527.3611 536.4429 539.6560 596.2909 605.5433 646.4873 701.6718 736.3215 739.5063 770.4497 775.9458 813.9581 825.0234 839.9877 886.3012 905.1356 914.3486 947.1754 957.8066 973.7492 987.6764 1000.5174 1015.1539 1031.4947 1036.6017 1045.4117 1054.2261 1104.0740 1133.9550 1168.1036 1175.4083 1211.7696 1220.9254 1253.0561 1263.6461 1280.9531 1299.9201 1366.0902 1374.8348 1387.6263 1392.5837 1399.1189 1403.1997 1408.4548 1432.2301 1458.7449 1461.3847 1468.8241 1471.8473 1475.6018 1485.9996 1495.9818 1508.4678 1526.7427 1574.0521 1606.5103 1631.5705 1635.4625 2965.7720 2967.9887 2971.1773 3037.7171 3040.8895 3053.6491 3075.5988 3078.0973 3082.3852 3112.5837 3116.5779 3118.5601 3126.6831 3142.2426 3155.9473 3240.1334
redmass: 2.9363 3.5432 1.0848 1.7360 1.4660 3.1610 3.8099 3.2188 2.5385 2.6540 3.5188 2.3088 4.6873 1.6425 3.7548 2.5996 4.2462 3.0806 4.5755 5.2402 3.2844 4.4332 3.3120 4.4900 3.2654 5.8468 2.5974 5.7824 1.2222 4.7716 4.2526 2.0373 1.7349 1.4317 1.6051 1.5606 4.1277 2.2430 1.3634 1.4176 1.5156 1.5378 1.4539 2.2037 1.5655 1.6722 2.4289 2.3467 1.5283 1.2549 2.2927 1.4791 2.6696 1.9662 3.3071 1.4362 4.4402 3.4297 4.2831 1.2886 1.2931 1.3160 2.6543 2.2356 1.0476 1.5464 1.3331 1.0459 1.5337 1.0484 1.1456 3.7137 3.0733 6.8413 5.6149 6.6953 6.7409 1.0378 1.0377 1.0373 1.0969 1.0968 1.0985 1.0976 1.0985 1.0980 1.0904 1.0864 1.0857 1.0915 1.0989 1.0998 1.0873
irintensity: 0.0105 0.5383 0.0001 3.6425 0.3492 0.6305 0.8766 0.0786 0.4374 5.9543 0.8055 4.0152 0.1416 0.0237 0.6766 4.8439 0.6645 0.6401 0.0740 0.8436 1.2165 1.0803 1.0480 0.9868 1.4976 2.8982 17.8961 0.6280 24.8349 0.5790 2.4738 7.3156 29.2721 20.4336 0.0214 32.8020 3.3677 5.0796 0.8967 0.4038 11.1094 2.0318 16.9809 1.2741 7.5145 0.0560 9.3534 3.8551 5.6939 3.6849 4.5659 2.3080 3.5259 0.6473 2.7259 1.8905 4.0177 0.8612 1.1169 6.6404 14.4322 8.1372 3.8593 1.9711 0.0268 16.5366 21.6862 31.2410 18.8426 12.1476 22.7223 5.0022 11.6798 2.8507 3.2949 2.7269 2.4378 45.7629 51.9455 28.1039 33.3512 10.3219 16.8834 36.0442 27.7664 9.6585 14.0900 5.7348 5.2230 21.6737 38.2812 44.0145 7.0567
temp: 298.150 k
press: 1.00000 atm
elementType: 6 6 6 6 6 6 6 6 6 6 6 6 6 6 6 6 6 1 1 1 1 1 1 1 1 1 1 1 1 1 1 1 1
symmnumber: 1
zpe: 717782.7 jmol-1
zpe.correction: 0.273389 hartree
zpe.thermalcorrener: 0.287036 hartree
zpe.thermalcorrenthalpy: 0.287980 hartree
zpe.thermalcorrgfe: 0.234077 hartree
zpe.sumelectzpe: -656.260243 hartree
zpe.sumelectthermal: -656.246596 hartree
zpe.sumelectthermalent: -656.245652 hartree
zpe.sumelectthermalfe: -656.299555 hartree
dipole: 1.0981 0.6878 0.0004
dipole: 1.2957
quadrupole: -86.2430 -88.5886 -107.1692
quadrupole: 0.1747 0.0002 -0.0006
quadrupole: 7.7572 5.4117 -13.1689 0.1747 0.0002 -0.0006
hfenergy: -656.5336322 hartree
pointgroup: C01 [X(C17H16)]
dipole: 0.4313059 -0.2717335 -0.0001703 debye
polarizability: 307.0824445|-0.9400305|203.1667845|-0.0055544|-0.0029742|84.2305682 unknown
InChI: InChI=1S/C17H16/c1-11-5-4-6-14-7-8-15-9-12(2)13(3)10-16(15)17(11)14/h4-10H,1-3H3
charge 0 multiplicity 1
33 atoms
C  0.266967 -0.05483 -0.000023
C  -1.207504 -0.19293 -0.000016
C  0.856338 1.270179 -0.000162
C  -1.990755 1.034425 0.000018
C  1.201192 -1.141657 0.000112
C  -1.950078 -1.44163 -0.000068
C  2.598258 -0.97665 0.000053
C  3.159834 0.344202 -0.000178
C  2.274562 1.429022 -0.000243
C  0.022701 2.446654 -0.000152
C  -1.348241 2.328643 -0.000037
C  -3.417714 1.00759 0.000065
C  -3.362466 -1.410206 -0.000063
C  -1.339174 -2.838097 -0.000531
C  -4.107226 -0.204412 0.000013
C  3.505113 -2.195443 0.000209
C  4.661747 0.558532 -0.000418
H  0.844416 -2.167768 0.00035
H  2.67606 2.450617 -0.000381
H  0.50302 3.432136 -0.000247
H  -1.9867 3.219994 -0.000033
H  -3.959717 1.960664 0.000061
H  -3.901828 -2.364823 -0.000165
H  -0.717105 -3.025701 0.894395
H  -2.143543 -3.59322 -0.001262
H  -0.716324 -3.024767 -0.895106
H  -5.202113 -0.23167 0.000023
H  4.166905 -2.211389 0.888059
H  2.919794 -3.130739 0.000221
H  4.167063 -2.211503 -0.887519
H  4.911509 1.633171 -0.000174
H  5.138839 0.099801 0.887246
H  5.138468 0.100306 -0.888549
