program: Gaussian 09
title: 000219185
version: EM64L-G09RevD.01
frameworkgroup: C1[X(C18H13NOS)]
method: RPBEPBE
basis: SDD
operation: Freq
keyword: #p
keyword: freq=noraman
keyword: PBEPBE/SDD
title: #p freq=noraman PBEPBE/SDD
converged: YES YES NO NO
title: Mulliken charges:
elementType: S O N C C C C C C C C C C C C C C C C C C H H H H H H H H H H H H H
charge: 0.246167 -0.239913 -0.346014 0.504549 -0.621146 0.435866 0.493770 0.401503 -0.327184 -0.341201 -0.475499 -0.408533 -0.299875 0.175889 -0.421741 -0.270225 -0.241360 -0.230622 -0.243311 -0.239079 -0.766798 0.256116 0.243413 0.255349 0.276487 0.244803 0.250823 0.232104 0.232784 0.232288 0.233110 0.262332 0.257719 0.237428
chargesum: 0.00000
title: Mulliken charges with hydrogens summed into heavy atoms:
elementType: S O N C C C C C C C C C C C C C C C C C C
charge: 0.246167 -0.239913 -0.346014 0.504549 -0.621146 0.435866 0.493770 0.401503 -0.327184 -0.085085 -0.232086 -0.153184 -0.023388 0.175889 -0.176937 -0.019402 -0.009256 0.002162 -0.011023 -0.005969 -0.009319
polarizability: 3.29425368e+02 5.97817609e+00 2.28946302e+02 -9.72004182e+00 -2.22558347e+01 1.28382693e+02
1716.lowfreq: -6.9620 -0.0023 -0.0018 -0.0009 3.4657 6.6158 43.9852 56.6740 78.4884
frequency: 43.9753 56.6736 78.4839 89.5604 116.2382 126.4681 133.5915 172.0105 189.0161 222.7428 266.5811 276.2380 333.6848 353.5439 366.4856 376.0791 414.7540 417.0774 436.0201 448.2457 504.8820 516.8541 525.6641 535.9655 547.3023 569.2906 585.9508 609.8415 646.4403 656.9938 676.0688 697.9648 722.4116 756.2230 760.6558 786.5944 808.1397 823.1353 827.4147 857.8714 884.1637 894.4632 939.7392 954.0499 955.5968 972.1773 981.7044 994.4398 1003.8351 1018.6637 1027.0086 1034.9038 1045.8913 1052.0990 1126.9497 1136.5893 1158.3393 1172.3033 1176.0277 1201.7739 1234.3349 1251.8581 1266.0118 1276.7279 1296.1826 1337.0453 1378.0148 1386.6110 1399.8941 1409.4912 1424.4920 1430.0546 1450.8657 1452.0612 1462.7799 1465.8587 1506.9701 1565.6551 1583.0203 1589.1376 1596.4647 1609.0996 1631.0075 3002.7719 3094.5175 3125.5673 3126.3264 3134.0254 3135.7617 3136.8431 3149.5346 3150.0961 3161.4935 3166.0388 3167.1073 3195.6487
redmass: 6.0260 6.5249 4.8754 3.7909 2.2844 1.5055 3.9271 4.2799 6.5678 4.4208 5.5745 5.6826 6.5665 4.7560 7.0431 7.0590 3.8311 4.8288 5.6065 3.5787 4.7530 3.9352 5.1261 4.4563 3.8349 3.9100 6.3584 4.3007 5.7249 6.1412 4.4479 5.7492 4.0844 1.2873 1.3488 3.1343 5.1795 2.4051 2.1436 1.3977 1.6843 4.9274 1.4234 5.2302 1.3779 1.3969 1.3232 1.3398 1.8853 4.1169 2.8096 1.6629 2.3288 3.2442 1.6247 1.7384 1.2592 1.0676 1.0901 2.7486 1.8198 1.9109 1.7240 3.7357 2.9057 2.7399 10.1330 1.2168 5.0357 3.4505 3.1207 2.3893 1.3484 1.6864 1.3267 1.8111 3.6207 7.8269 7.1094 6.4659 7.5886 7.4749 6.9897 1.0375 1.0956 1.0863 1.1017 1.0880 1.0881 1.0858 1.0950 1.0917 1.0970 1.1005 1.0985 1.0957
irintensity: 0.2337 3.2461 2.1959 1.7814 1.2462 0.2122 0.7048 2.9374 2.3160 2.2519 0.5275 0.5227 2.5626 3.7424 0.8623 2.1550 2.3705 0.6546 3.5688 8.3117 3.7111 5.2964 2.0938 6.7096 3.7395 16.4411 3.6581 4.4741 2.1433 17.2031 5.3114 0.5219 5.5811 98.9089 18.9663 12.4010 5.9860 24.6323 44.5994 0.7754 3.3334 3.6980 1.0998 17.7025 2.1929 4.9510 0.1491 0.1477 15.5810 4.2462 22.2472 6.1918 7.3263 5.5642 6.1609 2.3389 1.2838 0.7767 2.2255 31.5547 1.0838 79.6113 55.1687 296.3724 40.9546 46.4184 2.5937 44.7404 41.5173 15.6859 3.9769 7.9066 17.5168 81.1233 25.0014 35.3197 17.0065 54.5789 46.7489 3.1570 127.2902 96.2576 0.9937 5.1532 7.9894 1.4184 12.5894 2.2394 6.3584 1.4531 21.5370 11.1166 14.8333 32.1652 25.2229 2.0879
temp: 298.150 k
press: 1.00000 atm
elementType: 16 8 7 6 6 6 6 6 6 6 6 6 6 6 6 6 6 6 6 6 6 1 1 1 1 1 1 1 1 1 1 1 1 1
symmnumber: 1
zpe: 674772.9 jmol-1
zpe.correction: 0.257007 hartree
zpe.thermalcorrener: 0.273798 hartree
zpe.thermalcorrenthalpy: 0.274742 hartree
zpe.thermalcorrgfe: 0.212649 hartree
zpe.sumelectzpe: -1220.346388 hartree
zpe.sumelectthermal: -1220.329598 hartree
zpe.sumelectthermalent: -1220.328654 hartree
zpe.sumelectthermalfe: -1220.390746 hartree
dipole: -3.3858 -0.4028 -1.6345
dipole: 3.7812
quadrupole: -122.2513 -116.5022 -130.2782
quadrupole: -10.4093 -5.3738 -5.4314
quadrupole: 0.7593 6.5083 -7.2676 -10.4093 -5.3738 -5.4314
hfenergy: -1220.6033958 hartree
pointgroup: C01 [X(C18H13N1O1S1)]
dipole: 1.3289173 -0.1545589 0.6505433 debye
polarizability: 329.6343897|-5.2780178|228.4258998|-8.5893899|23.1086668|128.6940735 unknown
InChI: InChI=1S/C18H13NOS/c1-12(20)19-15-8-4-5-9-17(15)21-18-14-7-3-2-6-13(14)10-11-16(18)19/h2-11H,1H3
charge 0 multiplicity 1
34 atoms
S  -0.201754 -1.540299 -1.373994
O  -3.214193 2.278504 -0.802289
N  -1.370188 0.973973 -0.186067
C  0.050135 0.845866 0.047287
C  0.744763 -0.270368 -0.440808
C  2.157364 -0.424389 -0.217124
C  -2.184789 -0.188946 0.101187
C  2.852667 0.610031 0.5267
C  -1.745915 -1.447882 -0.376251
C  0.73685 1.820328 0.84193
C  2.108135 1.715341 1.055806
C  2.908265 -1.543381 -0.707286
C  -3.387504 -0.105213 0.840246
C  -1.960027 2.141449 -0.745421
C  4.26547 0.489038 0.734076
C  -2.492833 -2.617653 -0.126313
C  4.285412 -1.630452 -0.489753
C  -4.149579 -1.270863 1.071125
C  4.973158 -0.605149 0.232656
C  -3.707182 -2.52497 0.590171
C  -1.020597 3.200739 -1.312843
H  0.162972 2.645953 1.273856
H  2.631896 2.474267 1.647648
H  2.386509 -2.338874 -1.249898
H  -3.728421 0.867633 1.198536
H  4.784003 1.274217 1.296792
H  -2.129478 -3.585042 -0.487722
H  4.844741 -2.492057 -0.86983
H  -5.088516 -1.198045 1.629784
H  6.053201 -0.686792 0.395282
H  -4.297299 -3.428306 0.77696
H  -1.549921 3.682689 -2.149992
H  -0.05982 2.791504 -1.661869
H  -0.810725 3.982849 -0.560988
