program: Gaussian 09
title: 000219181
version: EM64L-G09RevD.01
frameworkgroup: C1[X(C14H10ClNOS)]
method: RPBEPBE
basis: SDD
operation: Freq
keyword: #p
keyword: freq=noraman
keyword: PBEPBE/SDD
title: #p freq=noraman PBEPBE/SDD
converged: NO YES NO NO
title: Mulliken charges:
elementType: Cl S O N C C C C C C C C C C C C C C H H H H H H H H H H
charge: -0.020043 0.231317 -0.197185 -0.516210 0.612142 -0.366288 0.573184 -0.311228 -0.570606 0.349953 -0.287496 -0.377207 -0.412113 -0.276881 -0.210993 0.183493 -0.253906 -0.715356 0.312617 0.276301 0.242928 0.240862 0.228199 0.240340 0.232908 0.235346 0.277937 0.277986
chargesum: 0.00000
title: Mulliken charges with hydrogens summed into heavy atoms:
elementType: Cl S O N C C C C C C C C C C C C C C
charge: -0.020043 0.231317 -0.197185 -0.203593 0.612142 -0.366288 0.573184 -0.311228 -0.294305 0.349953 -0.044568 -0.136345 -0.183914 -0.036541 0.021916 0.183493 -0.018560 -0.159433
polarizability: 3.74839832e+02 -1.20245516e+00 1.89568561e+02 8.65432545e-02 4.30715773e-02 7.19480254e+01
1716.lowfreq: -21.1807 -2.3936 -0.0020 0.0005 0.0011 3.7438 9.2147 34.5238 62.2020
frequency: -21.0258 34.4477 62.1522 79.9236 81.8194 131.5608 192.0152 197.7077 203.0694 252.0878 257.7528 270.8578 351.0599 372.5842 424.7319 436.8016 438.7064 462.9834 501.4913 504.7643 523.9459 561.6014 595.7895 631.9866 651.6360 660.0679 664.7620 713.2952 727.0352 744.2127 752.1323 755.2983 801.0542 837.8278 848.9181 900.4454 912.8753 928.2174 930.6341 946.2398 969.4065 1022.3549 1031.9220 1052.5336 1055.9856 1127.3613 1150.8410 1158.2899 1173.6532 1182.9960 1241.2907 1253.1748 1281.8101 1287.1699 1298.3430 1364.0582 1397.8504 1402.3525 1418.7164 1426.7917 1485.1510 1487.3655 1517.8359 1565.8386 1588.0766 1594.6570 1603.6466 1621.4482 3033.1757 3107.0852 3117.8859 3129.6543 3134.1096 3137.3667 3150.4605 3164.5316 3173.1163 3554.8741
redmass: 6.0167 12.3869 4.2443 3.5619 9.5225 4.7862 7.2580 5.5819 12.4780 3.9339 8.5137 5.2268 8.4137 7.5886 10.0044 3.2345 3.0814 7.4207 2.6438 8.0707 2.4678 1.6267 7.3684 3.3843 8.0539 6.8934 6.6563 3.1600 3.3401 6.7493 1.3625 7.0228 1.3326 5.8256 1.4389 1.5922 5.0809 1.3825 1.5859 1.5982 1.3193 5.7038 3.4840 2.2118 4.5340 1.6379 1.0850 1.6157 1.0743 1.6029 1.6946 1.8168 1.5451 1.5480 2.3780 2.7947 4.1585 8.7989 1.0906 2.5209 3.3662 2.9013 2.1224 7.4048 4.7417 5.3615 7.3783 7.4765 1.0566 1.1067 1.0887 1.0911 1.0886 1.0884 1.0923 1.0954 1.1004 1.0760
irintensity: 0.2772 0.0809 9.9598 1.9440 2.6749 0.0015 0.5542 0.2942 0.0750 5.3144 2.6870 0.5702 0.1092 0.4006 0.0528 3.2026 18.3184 3.3728 10.6498 18.1147 18.5471 26.4411 0.2512 18.0406 16.6414 15.8988 6.4178 4.6334 7.6254 71.6233 110.9227 6.8437 36.2158 2.6213 3.3813 26.4227 11.3246 3.3180 9.1112 0.2777 0.1607 33.9956 36.2480 46.8225 65.7493 29.2807 1.9139 28.5102 1.1611 146.4970 9.5212 32.9109 4.3605 5.1754 112.7366 14.3353 39.0954 70.1274 10.4061 32.4847 545.7510 41.4491 175.5898 99.0333 48.2448 67.6984 65.0757 0.2972 25.5063 3.5100 9.5766 11.3701 1.0560 6.1727 14.1685 9.2489 25.3885 21.6916
temp: 298.150 k
press: 1.00000 atm
elementType: 17 16 8 7 6 6 6 6 6 6 6 6 6 6 6 6 6 6 1 1 1 1 1 1 1 1 1 1
symmnumber: 1
zpe: 531187.8 jmol-1
zpe.correction: 0.202319 hartree
zpe.thermalcorrener: 0.216822 hartree
zpe.thermalcorrenthalpy: 0.217766 hartree
zpe.thermalcorrgfe: 0.159644 hartree
zpe.sumelectzpe: -1526.345329 hartree
zpe.sumelectthermal: -1526.330825 hartree
zpe.sumelectthermalent: -1526.329881 hartree
zpe.sumelectthermalfe: -1526.388003 hartree
dipole: 4.3649 1.7120 0.0035
dipole: 4.6886
quadrupole: -127.9476 -109.1699 -123.7500
quadrupole: -20.0606 0.0185 0.0233
quadrupole: -7.6584 11.1193 -3.4608 -20.0606 0.0185 0.0233
hfenergy: -1526.5476473 hartree
pointgroup: C01 [X(C14H10Cl1N1O1S1)]
dipole: 1.686595 0.7470614 0.0014576 debye
polarizability: 374.5982214|6.7920167|189.8100599|0.2006265|-0.044201|71.9481378 unknown
InChI: InChI=1S/C14H10ClNOS/c15-8-12(17)9-5-6-14-11(7-9)16-10-3-1-2-4-13(10)18-14/h1-7,16H,8H2
charge 0 multiplicity 1
28 atoms
Cl -6.615628 -0.615483 -0.000916
S  1.769493 2.088783 -0.005651
O  -3.876199 -1.850749 -0.003104
N  1.12015 -1.039464 -0.004932
C  0.010341 -0.176768 -0.003903
C  0.148281 1.244197 -0.003312
C  2.486664 -0.691131 -0.001304
C  2.931007 0.658303 -0.000382
C  -1.290195 -0.726104 -0.003473
C  -2.448829 0.093332 -0.002584
C  -1.000269 2.063109 -0.002024
C  -2.294311 1.504298 -0.001745
C  3.459635 -1.723987 0.001605
C  4.307596 0.955815 0.003601
C  4.838259 -1.42486 0.005196
C  -3.78105 -0.593393 -0.002506
C  5.270093 -0.080738 0.006306
C  -5.01579 0.32441 -0.001833
H  0.91077 -2.038405 -0.005876
H  -1.436846 -1.813129 -0.00393
H  -0.878382 3.151851 -0.001416
H  -3.157905 2.176094 -0.00092
H  3.124742 -2.769036 0.001039
H  4.632589 2.002554 0.004421
H  5.568117 -2.240913 0.00724
H  6.336311 0.165065 0.009206
H  -5.021764 0.962062 0.897492
H  -5.022779 0.961889 -0.901293
