program: Gaussian 09
title: 000019351
version: EM64L-G09RevD.01
frameworkgroup: C1[X(C16H14)]
method: RPBEPBE
basis: SDD
operation: Freq
keyword: #p
keyword: freq=noraman
keyword: PBEPBE/SDD
title: #p freq=noraman PBEPBE/SDD
converged: YES YES NO NO
title: Mulliken charges:
elementType: C C C C C C C C C C C C C C C C H H H H H H H H H H H H H H
charge: 0.216843 0.421967 0.212104 0.525973 0.420606 -0.657663 -0.383116 -0.489371 -0.425933 -0.538323 -0.477993 -0.374674 -0.432734 -0.257810 -0.675636 -0.250618 0.243190 0.220893 0.236128 0.232494 0.210526 0.209176 0.234128 0.223014 0.238535 0.226349 0.222394 0.216861 0.224545 0.228144
chargesum: 0.00000
title: Mulliken charges with hydrogens summed into heavy atoms:
elementType: C C C C C C C C C C C C C C C C
charge: 0.216843 0.421967 0.212104 0.525973 0.420606 -0.414473 -0.162222 -0.253244 -0.193438 -0.118621 -0.243864 -0.151659 -0.194198 -0.031462 -0.011837 -0.022473
polarizability: 2.95942808e+02 -2.98071148e+00 1.77035672e+02 8.91082855e+00 1.67953724e+00 7.84319627e+01
1716.lowfreq: -2.8515 -0.0007 -0.0005 0.0002 4.2828 10.5148 44.1576 62.4235 101.9246
frequency: 44.0593 62.3233 101.9228 141.3948 178.6281 227.7363 229.8082 243.9856 310.0222 354.9546 395.1939 408.3764 444.8475 458.2832 493.0856 536.0014 537.2406 549.5317 570.5409 642.9590 671.9532 714.1643 733.3893 757.3972 760.5236 789.8564 798.6406 830.3657 842.0694 855.4615 887.1085 907.0076 914.4173 954.1596 967.3206 981.8180 983.9665 991.1754 992.3207 1039.8175 1057.0784 1067.9184 1098.1932 1152.8739 1167.6474 1176.9208 1187.3031 1231.4226 1241.4635 1251.6518 1264.6546 1282.1337 1311.0076 1316.9348 1384.3494 1391.4351 1401.4728 1403.5362 1426.5772 1448.2501 1465.0918 1472.9362 1474.3171 1489.1889 1497.6565 1533.3512 1577.5070 1609.0376 1626.9067 1632.4164 2980.2280 2982.7593 3035.7245 3078.4789 3084.3590 3109.8491 3116.6063 3117.7370 3120.6936 3131.7014 3141.8621 3146.1999 3153.4892 3164.9799
redmass: 2.6808 3.7042 3.6804 3.9263 1.9323 3.1919 2.1881 2.4575 3.0807 3.4538 3.1354 3.9305 3.0406 3.8918 5.5577 3.6882 2.7692 6.7989 4.3116 3.3177 4.4527 5.4989 2.8957 1.2948 4.5414 1.2265 1.8112 1.4366 1.6803 4.6160 1.9643 3.0848 1.5861 1.4125 1.3630 1.3792 2.3459 1.3938 5.4887 2.1848 1.8250 1.7185 2.1770 1.3454 1.3227 1.0893 1.3968 2.0366 1.4255 1.4556 1.9590 1.5969 1.8102 1.8270 2.3981 1.2262 3.4135 5.1907 2.7122 3.6178 2.4539 1.1056 1.0539 1.0993 3.2812 3.8026 7.5705 5.9254 6.6301 6.6971 1.0386 1.0569 1.1007 1.1000 1.1011 1.0912 1.0861 1.0876 1.0863 1.0886 1.0982 1.0954 1.0938 1.0991
irintensity: 0.1757 0.5846 0.0344 0.0356 0.2904 3.2131 1.4060 0.3015 0.1802 0.0738 0.1042 1.8860 13.4224 3.3534 1.0380 0.2516 0.1899 0.2887 2.1010 5.4624 2.2228 0.0596 16.8341 57.6437 1.5289 3.1578 2.9858 50.3860 19.7848 4.3129 6.4247 3.7517 30.7179 4.5477 1.7860 0.0436 1.2081 0.1460 4.5227 5.9119 15.4510 8.6381 3.6210 1.8854 0.5497 0.7221 3.2405 3.9764 2.3286 10.9494 5.5866 0.1886 2.7186 1.5607 0.5374 9.3452 0.5971 0.6145 4.7315 3.8488 11.7132 7.8711 10.9772 14.3044 10.4781 2.7958 0.0884 3.9202 1.1741 14.7375 43.9541 43.9033 8.7848 67.3673 37.2937 16.9759 3.4375 17.9667 1.6352 8.8354 34.3706 6.0210 38.8521 36.8124
temp: 298.150 k
press: 1.00000 atm
elementType: 6 6 6 6 6 6 6 6 6 6 6 6 6 6 6 6 1 1 1 1 1 1 1 1 1 1 1 1 1 1
symmnumber: 1
zpe: 647836.1 jmol-1
zpe.correction: 0.246748 hartree
zpe.thermalcorrener: 0.259426 hartree
zpe.thermalcorrenthalpy: 0.260370 hartree
zpe.thermalcorrgfe: 0.207482 hartree
zpe.sumelectzpe: -617.035425 hartree
zpe.sumelectthermal: -617.022747 hartree
zpe.sumelectthermalent: -617.021803 hartree
zpe.sumelectthermalfe: -617.074691 hartree
dipole: -0.6624 -0.0782 0.0472
dipole: 0.6687
quadrupole: -79.8412 -82.3490 -101.3738
quadrupole: 0.0941 1.3252 0.6120
quadrupole: 8.0134 5.5057 -13.5191 0.0941 1.3252 0.6120
hfenergy: -617.2821727 hartree
pointgroup: C01 [X(C16H14)]
dipole: 0.2602314 -0.0312749 -0.0225713 debye
polarizability: 296.1088096|1.7124134|176.8588935|7.2434422|4.123468|78.44274 unknown
InChI: InChI=1S/C16H14/c1-2-12-7-10-16-14(11-12)9-8-13-5-3-4-6-15(13)16/h3-11H,2H2,1H3
charge 0 multiplicity 1
30 atoms
C  0.051234 -0.31459 0.090218
C  0.702399 0.969601 0.173464
C  -1.410057 -0.374039 -0.0036
C  2.928089 -0.112311 0.275599
C  -2.164585 0.856751 -0.009009
C  2.127031 1.039236 0.266281
C  0.880358 -1.478568 0.107132
C  -0.093867 2.177336 0.166085
C  2.273762 -1.381811 0.196184
C  4.446638 -0.032846 0.334003
C  -1.47128 2.122976 0.078112
C  -2.133652 -1.603679 -0.091837
C  -3.590558 0.814249 -0.100691
C  -3.532543 -1.623536 -0.180954
C  5.10932 -0.309919 -1.042449
C  -4.271595 -0.405522 -0.18555
H  2.598602 2.028601 0.331955
H  0.427125 -2.473464 0.053932
H  0.422633 3.142398 0.232108
H  2.879641 -2.296402 0.211856
H  4.755992 0.967718 0.690624
H  4.83154 -0.766577 1.069513
H  -2.066746 3.043766 0.072785
H  -1.594728 -2.556159 -0.09164
H  -4.146228 1.759809 -0.103359
H  -4.06096 -2.581016 -0.247784
H  4.836791 -1.312601 -1.418994
H  6.211088 -0.260197 -0.966472
H  4.779916 0.430643 -1.793288
H  -5.364561 -0.427645 -0.255226
