program: Gaussian 09
title: 000219179
version: EM64L-G09RevD.01
frameworkgroup: C1[X(C14H12N2O3S)]
method: RPBEPBE
basis: SDD
operation: Freq
keyword: #p
keyword: freq=noraman
keyword: PBEPBE/SDD
title: #p freq=noraman PBEPBE/SDD
converged: NO YES NO NO
title: Mulliken charges:
elementType: S O O O N N C C C C C C C C C C C C C C H H H H H H H H H H H H
charge: 0.672683 -0.589644 -0.217432 -0.203487 -0.273550 0.017967 0.528023 0.433428 -0.334666 -0.321838 -0.367195 -0.279772 -0.422680 -0.310153 -0.238599 0.415470 -0.682115 -0.413877 -0.227690 -0.242596 0.219885 0.232956 0.259240 0.335525 0.243089 0.287952 0.235336 0.247182 0.227612 0.290007 0.234785 0.244154
chargesum: 0.00000
title: Mulliken charges with hydrogens summed into heavy atoms:
elementType: S O O O N N C C C C C C C C C C C C C C
charge: 0.672683 -0.589644 -0.217432 -0.203487 -0.273550 0.017967 0.528023 0.433428 -0.334666 -0.321838 0.085646 -0.020532 -0.087155 -0.067064 0.049353 0.415470 0.028015 -0.123870 0.007095 0.001558
polarizability: 3.20053078e+02 -6.13534125e-01 2.17528702e+02 1.00733466e+01 -1.27432592e+01 1.11465621e+02
1716.lowfreq: -7.5017 -6.8220 -4.3087 -0.0018 -0.0013 0.0005 38.2539 55.7756 73.3793
frequency: 38.2507 55.7479 73.3755 78.4977 109.1046 130.4484 141.1564 159.2777 163.7740 184.6850 218.1120 240.1183 256.0622 305.3272 310.3585 318.9473 373.4295 376.9906 400.5857 424.2760 447.8538 485.3188 504.0565 521.6200 521.8458 550.6045 584.5509 622.0353 651.4421 660.0359 689.4457 714.7057 719.0238 740.5629 763.1341 788.0110 802.9734 817.6698 831.2041 859.9087 885.7518 940.8960 945.4584 950.2891 981.8629 986.9623 1002.6344 1014.6528 1036.5561 1074.8251 1095.4830 1103.8832 1128.6890 1132.6656 1147.8393 1175.3420 1208.3459 1229.6010 1251.1195 1261.2701 1286.0892 1317.6951 1350.5566 1366.3832 1382.5042 1394.3664 1398.4379 1429.7473 1432.9915 1451.2984 1466.6552 1469.6742 1484.0006 1495.3606 1564.5910 1575.8139 1592.1356 1618.1857 2965.9774 2996.8265 3077.8638 3093.6006 3106.2849 3135.5474 3141.6154 3152.2201 3159.1849 3161.8868 3173.9822 3184.6085
redmass: 7.9075 10.4088 3.6104 4.1473 7.7614 4.7974 3.4164 3.3578 5.9371 1.8744 3.3166 3.7948 6.3184 6.7490 3.3380 7.1090 6.4609 6.1667 4.8597 5.3183 4.0848 4.9040 6.3116 5.0786 4.7898 4.5935 4.0698 6.7053 6.2875 6.9868 6.1719 7.4235 4.4272 3.7812 1.3548 1.5363 11.2188 4.2089 1.4813 1.3696 3.6485 2.2044 1.3918 1.4481 1.3440 1.3503 3.9457 3.6373 2.1675 3.1175 1.9851 3.6492 1.5213 1.7090 1.3613 1.0794 5.8931 1.8637 2.3604 1.6271 1.4108 1.8382 3.7058 2.2587 4.3631 3.5347 1.3252 4.9575 2.7135 2.6872 2.0855 1.1619 1.0610 1.1123 7.1470 7.0441 7.1648 7.4619 1.0700 1.0361 1.0932 1.0988 1.1001 1.0871 1.0893 1.0921 1.0933 1.0886 1.1002 1.0959
irintensity: 0.2508 0.0978 0.0950 2.5045 0.7762 0.3346 2.7237 0.5558 7.6555 0.4608 3.3160 0.9093 0.3944 1.1481 2.5903 2.1706 9.3227 8.9460 4.4679 0.8030 7.8117 31.1916 6.2349 7.7837 8.4496 2.9762 9.6551 0.5064 0.3770 1.2428 11.5578 12.8090 6.9003 7.8727 107.6681 3.7510 36.5109 16.6608 39.4948 0.6531 14.4467 2.1985 18.5652 4.2583 4.4864 0.8470 1.4508 2.3436 12.4093 18.2077 19.1546 14.3360 9.2285 15.8937 54.7444 4.9772 622.6219 143.0077 52.4502 24.6863 19.1827 114.1738 46.7510 36.7641 15.8010 26.8286 31.4344 3.9353 9.7913 199.0606 23.9594 12.9363 0.6167 13.6558 10.3544 3.2894 118.5460 74.2451 44.6285 20.6733 1.3463 30.5435 28.7619 3.2301 3.4357 13.6532 10.0604 9.5335 23.1036 4.2238
temp: 298.150 k
press: 1.00000 atm
elementType: 16 8 8 8 7 7 6 6 6 6 6 6 6 6 6 6 6 6 6 6 1 1 1 1 1 1 1 1 1 1 1 1
symmnumber: 1
zpe: 613772.4 jmol-1
zpe.correction: 0.233774 hartree
zpe.thermalcorrener: 0.251233 hartree
zpe.thermalcorrenthalpy: 0.252177 hartree
zpe.thermalcorrgfe: 0.188305 hartree
zpe.sumelectzpe: -1272.340715 hartree
zpe.sumelectthermal: -1272.323256 hartree
zpe.sumelectthermalent: -1272.322312 hartree
zpe.sumelectthermalfe: -1272.386184 hartree
dipole: -7.8300 7.4407 -0.3522
dipole: 10.8073
quadrupole: -140.2146 -122.0910 -123.2258
quadrupole: 4.9366 8.9084 2.4890
quadrupole: -11.7041 6.4195 5.2847 4.9366 8.9084 2.4890
hfenergy: -1272.574489 hartree
pointgroup: C01 [X(C14H12N2O3S1)]
dipole: 3.0184003 -2.9891018 -0.1826441 debye
polarizability: 320.3645907|-3.0551575|216.2900152|-3.9969301|17.4380569|112.3927961 unknown
InChI: InChI=1S/C14H12N2O3S/c1-2-15-11-5-3-4-6-13(11)20(19)14-9-10(16(17)18)7-8-12(14)15/h3-9H,2H2,1H3
charge 0 multiplicity 1
32 atoms
S  0.67461 1.466747 1.496379
O  0.335089 3.06925 1.181527
O  -5.062242 -0.199507 -0.964902
O  -4.418951 1.850348 -0.185911
N  1.145213 -1.344052 0.261245
N  -4.180121 0.614358 -0.477958
C  -0.199486 -0.912725 0.161023
C  2.195355 -0.409018 -0.035067
C  -0.568419 0.412877 0.528338
C  2.086798 0.950141 0.347409
C  1.44899 -2.800079 0.300938
C  -1.228128 -1.744686 -0.376956
C  -1.839166 0.946254 0.313941
C  3.334978 -0.773912 -0.804444
C  3.0118 1.93285 -0.029047
C  -2.819741 0.096788 -0.244866
C  0.81524 -3.50324 1.518032
C  -2.525611 -1.248049 -0.569225
C  4.30142 0.194301 -1.152113
C  4.142563 1.550946 -0.785745
H  1.143686 -3.294144 -0.644771
H  2.543284 -2.898412 0.376532
H  -1.00108 -2.768498 -0.68539
H  -2.066017 1.985346 0.577414
H  3.449625 -1.798024 -1.17195
H  2.831534 2.972668 0.267906
H  1.181803 -3.052838 2.456454
H  -0.285689 -3.441313 1.515973
H  1.095595 -4.571965 1.513815
H  -3.314831 -1.873832 -0.994106
H  5.170958 -0.112661 -1.743287
H  4.886042 2.296979 -1.082186
