program: Gaussian 09
title: 000219173
version: EM64L-G09RevD.01
frameworkgroup: C1[X(C13H19NO4S)]
method: RPBEPBE
basis: SDD
operation: Freq
keyword: #p
keyword: freq=noraman
keyword: PBEPBE/SDD
title: #p freq=noraman PBEPBE/SDD
converged: YES YES NO NO
title: Mulliken charges:
elementType: S O O O O N C C C C C C C C C C C C C H H H H H H H H H H H H H H H H H H H
charge: 0.925658 -0.530237 -0.533232 -0.286261 -0.249857 -0.320488 -0.340351 -0.341628 -0.022550 -0.655327 -0.654425 -0.268959 -0.227403 0.242644 -0.335198 -0.319901 0.197121 -0.258583 -0.662091 0.258269 0.219719 0.235716 0.232661 0.225396 0.257534 0.215123 0.263755 0.210871 0.213224 0.301320 0.280882 0.282121 0.281783 0.237500 0.224811 0.220845 0.229006 0.250529
chargesum: 0.00000
title: Mulliken charges with hydrogens summed into heavy atoms:
elementType: S O O O O N C C C C C C C C C C C C C
charge: 0.925658 -0.530237 -0.533232 -0.286261 -0.249857 -0.320488 0.137636 0.126749 -0.022550 0.042726 0.033425 0.032362 0.053480 0.242644 -0.053076 -0.038118 0.197121 0.203729 0.038289
polarizability: 2.79130740e+02 6.09173259e+00 1.69758236e+02 2.53896380e+00 -1.35969459e+01 1.39250444e+02
1716.lowfreq: -6.3805 -4.0207 0.0017 0.0023 0.0029 6.5586 21.2248 28.8752 33.0876
frequency: 21.1066 28.4312 32.9795 48.3320 58.1626 75.0489 86.5198 98.1503 110.3427 126.4327 154.4438 164.8799 178.4895 199.2006 216.5145 223.5780 248.4245 255.1165 272.8758 287.1861 309.4268 331.2471 354.3530 374.5159 393.7745 407.7200 418.3447 436.2739 476.0271 488.1258 506.0712 579.3808 617.7754 672.3273 679.9612 739.1588 750.2596 755.7011 757.2250 794.3449 817.3389 818.0149 836.5534 851.6188 881.1416 900.6662 925.9839 986.1515 993.7528 1002.7581 1004.3391 1005.6765 1047.6861 1056.1468 1061.7668 1074.2983 1084.1818 1095.9467 1107.8349 1156.8808 1159.6130 1174.9149 1180.4063 1242.0907 1272.4882 1279.1351 1287.6677 1299.2667 1342.7408 1350.6118 1356.8886 1385.4546 1388.3602 1392.1498 1392.9835 1394.4700 1438.8271 1451.1501 1456.5383 1463.2615 1466.8754 1470.6002 1473.4378 1484.2473 1488.5103 1493.0953 1585.7378 1594.7128 1622.9215 2976.4718 2988.1255 2992.9031 2994.4629 2995.5443 3029.4879 3032.1789 3061.4175 3080.3293 3085.5978 3089.9554 3095.0532 3106.7892 3116.8410 3120.9369 3151.3760 3162.9482 3169.9023 3186.2830
redmass: 4.0706 3.6590 3.9681 3.2479 4.4029 2.4826 4.2735 4.5539 2.7199 4.4904 3.1551 3.3107 4.4514 3.8248 1.7588 1.7637 2.1640 1.8605 2.7951 2.1949 3.2573 4.1325 6.2348 4.3393 3.1262 2.8990 3.8198 4.6224 4.4361 5.9760 3.7034 4.0717 7.0820 4.7909 5.7021 1.9385 3.3573 3.0810 1.2413 10.9712 1.5418 1.4962 3.5834 1.3672 1.4541 2.2240 13.7263 1.3787 4.7426 2.4493 2.8752 1.5310 2.8186 1.9107 3.6574 1.7867 1.7962 2.1743 1.3581 1.6671 1.8238 1.1364 3.0509 4.2357 1.2407 1.1205 1.2457 1.1493 1.2057 1.1789 1.2944 1.2049 3.0872 1.2382 9.8854 1.1935 1.0758 1.0758 1.1294 1.0557 2.1476 1.0455 1.0452 1.0536 1.0469 1.0489 8.0027 6.3518 9.7158 1.0601 1.0370 1.0454 1.0362 1.0546 1.1010 1.0592 1.0999 1.0982 1.0975 1.0973 1.1035 1.1021 1.1003 1.1064 1.0890 1.0898 1.0965 1.0963
irintensity: 1.2316 0.6852 0.4311 0.0994 0.5159 1.0073 0.2711 2.2000 0.9734 4.9708 0.2002 3.8057 2.0584 5.6670 4.9250 2.5813 0.6393 6.3450 1.6759 1.9666 16.9336 3.1140 25.6360 4.6994 25.4662 0.3836 5.5725 23.7469 16.9821 15.0660 18.4542 148.9512 0.2741 19.4874 33.8551 37.7951 24.1108 7.0555 5.2690 88.6159 1.0360 0.9508 6.8747 9.8875 27.9907 7.9828 73.4057 1.3533 16.1737 53.3956 14.2863 6.9722 83.5058 9.1662 245.4352 5.3416 5.9037 17.4813 10.2679 40.4840 1.6651 4.1226 42.6987 342.3052 15.3215 5.3144 1.5415 16.3643 4.0308 8.4699 5.7483 20.7790 29.9895 23.3208 3.9190 43.2230 12.0761 7.7421 24.4751 12.9503 5.7624 4.7561 15.5448 14.5806 6.1280 14.6709 20.6054 31.1511 161.8432 19.9742 27.0773 30.5171 20.3408 23.5217 9.8369 33.0952 4.1752 52.7268 17.9628 37.6141 0.7067 13.9282 25.5286 27.9874 4.2071 0.5998 0.3328 0.2252
temp: 298.150 k
press: 1.00000 atm
elementType: 16 8 8 8 8 7 6 6 6 6 6 6 6 6 6 6 6 6 6 1 1 1 1 1 1 1 1 1 1 1 1 1 1 1 1 1 1 1
symmnumber: 1
zpe: 791106.8 jmol-1
zpe.correction: 0.301317 hartree
zpe.thermalcorrener: 0.322942 hartree
zpe.thermalcorrenthalpy: 0.323886 hartree
zpe.thermalcorrgfe: 0.248656 hartree
zpe.sumelectzpe: -1258.855958 hartree
zpe.sumelectthermal: -1258.834332 hartree
zpe.sumelectthermalent: -1258.833388 hartree
zpe.sumelectthermalfe: -1258.908618 hartree
dipole: 2.0620 0.1255 5.0002
dipole: 5.4101
quadrupole: -102.0515 -124.4383 -125.7332
quadrupole: -12.2251 -9.4721 -2.4557
quadrupole: 15.3562 -7.0307 -8.3255 -12.2251 -9.4721 -2.4557
hfenergy: -1259.1572743 hartree
pointgroup: C01 [X(C13H19N1O4S1)]
dipole: -0.9453733 -0.6579337 -1.7899533 debye
polarizability: 277.2010453|-15.3297456|176.9090142|-0.2829204|-2.0160922|134.029361 unknown
InChI: InChI=1S/C13H19NO4S/c1-4-14(5-2)19(16,17)12-9-7-11(8-10-12)13(15)18-6-3/h7-10H,4-6H2,1-3H3
charge 0 multiplicity 1
38 atoms
S  2.374335 -0.575906 0.77235
O  3.019219 0.8567 1.238677
O  2.498057 -1.891959 1.725448
O  -4.366515 -0.575031 -0.39887
O  -4.0815 1.736846 -0.228257
N  2.935994 -1.149069 -0.912811
C  4.027038 -2.164838 -0.823937
C  3.002766 -0.048552 -1.9146
C  0.541144 -0.242697 0.429058
C  5.341299 -1.772908 -0.107816
C  4.212176 0.915525 -1.893809
C  0.110309 1.093679 0.41901
C  -0.315502 -1.34345 0.262354
C  -2.158167 0.254544 0.016221
C  -1.262708 1.338099 0.206236
C  -1.685595 -1.084175 0.050608
C  -3.602997 0.57571 -0.206161
C  -5.835403 -0.374696 -0.607126
C  -6.567558 -0.314374 0.735905
H  3.596448 -3.047571 -0.319589
H  4.222799 -2.448424 -1.877237
H  2.937747 -0.558243 -2.897003
H  2.065803 0.532722 -1.812011
H  5.844272 -0.913009 -0.577663
H  5.144541 -1.53032 0.950786
H  6.034263 -2.63465 -0.12958
H  4.324763 1.380021 -0.899685
H  5.151991 0.40318 -2.160945
H  4.046592 1.717725 -2.637348
H  0.82751 1.902044 0.595476
H  0.074201 -2.364598 0.30816
H  -1.659755 2.357853 0.187852
H  -2.39391 -1.904899 -0.087053
H  -5.982486 0.552177 -1.188463
H  -6.131828 -1.252246 -1.203503
H  -7.658026 -0.259469 0.560739
H  -6.360389 -1.214565 1.339593
H  -6.267029 0.578724 1.308793
