program: Gaussian 09
title: 000219170
version: EM64L-G09RevD.01
frameworkgroup: C1[X(C12H27N)]
method: RPBEPBE
basis: SDD
operation: Freq
keyword: #pfreq=noraman
keyword: PBEPBE/SDD
title: #p freq=noraman PBEPBE/SDD
converged: YES YES NO NO
title: Mulliken charges:
elementType: N C C C C C C C C C C C C H H H H H H H H H H H H H H H H H H H H H H H H H H H
charge: -0.104915 -0.367177 -0.387763 -0.384237 -0.359030 -0.372230 -0.353442 -0.319828 -0.320129 -0.356479 -0.678946 -0.674874 -0.696524 0.187882 0.188388 0.187841 0.214013 0.195349 0.191536 0.198033 0.181000 0.189669 0.189075 0.187628 0.188381 0.205673 0.183207 0.201505 0.183014 0.194854 0.194566 0.228231 0.206800 0.203960 0.227791 0.208825 0.204237 0.209583 0.209803 0.214734
chargesum: 0.00000
title: Mulliken charges with hydrogens summed into heavy atoms:
elementType: N C C C C C C C C C C C C
charge: -0.104915 0.009092 0.014091 0.002648 0.020003 0.006513 0.022567 0.069052 0.064390 0.032940 -0.039955 -0.034022 -0.062404
polarizability: 1.74032214e+02 -2.13540397e-01 1.31308339e+02 6.30041746e-01 7.08725152e-01 1.17622952e+02
1716.lowfreq: -5.4781 -0.0004 0.0003 0.0008 3.5889 15.1168 27.4672 35.7823 39.4199
frequency: 27.2730 35.6830 39.3655 62.7746 74.0044 80.5989 83.6765 104.5600 129.2255 138.8166 144.2689 177.2304 198.4894 229.9316 231.1091 260.9364 285.8289 303.6037 336.5044 391.9906 434.2522 438.7126 488.9969 508.1330 720.3968 725.7681 739.8067 746.0453 788.1708 796.1264 797.0825 852.8195 887.7878 911.1055 938.9485 973.4334 993.2397 1008.2009 1021.7315 1044.3230 1056.0025 1073.4774 1076.4260 1080.1306 1080.6339 1085.1933 1090.0133 1119.4338 1140.9504 1183.0537 1199.7334 1206.6079 1217.6561 1235.1793 1257.4757 1268.3367 1276.4713 1281.8787 1286.9502 1289.2952 1290.7229 1297.0024 1304.3412 1335.3748 1352.6323 1354.1372 1360.7041 1364.9565 1376.5876 1385.5567 1386.4623 1388.5631 1458.4397 1461.1048 1462.0681 1463.0198 1465.8185 1469.5531 1470.9617 1474.9185 1477.3180 1478.4799 1480.7043 1485.2553 1486.7653 1488.8864 1490.6739 2834.8033 2840.3819 2855.4394 2947.8724 2949.5271 2952.0000 2959.2949 2967.5009 2970.8202 2975.3477 2981.8201 2982.3013 2982.5153 2989.1897 3001.3939 3016.1268 3021.5537 3029.1794 3032.6506 3035.6928 3049.1995 3067.3598 3069.8055 3073.6917 3075.0120 3091.1149 3091.7800
redmass: 3.0744 1.8455 2.9705 2.9123 2.4916 1.6444 1.9257 2.4206 2.0244 2.0553 2.2442 2.7302 1.4867 1.2990 1.1137 2.3376 1.8949 2.2682 2.6198 3.1813 2.8081 2.8155 2.7015 2.9137 1.0607 1.0800 1.9572 1.3333 1.1901 1.1383 1.1990 1.2455 1.8907 1.7132 1.2916 2.5813 4.2192 1.1330 3.1005 3.0984 2.6323 1.8726 2.4208 2.1813 2.2398 2.1815 1.8687 2.4848 1.7244 1.9453 1.8327 1.9991 1.3865 1.4564 1.2846 1.2675 1.0594 1.1117 1.1988 1.1482 1.1371 1.1363 1.3514 1.4430 1.6160 1.6729 1.3266 1.3510 1.4290 1.2330 1.2329 1.2172 1.0686 1.0742 1.0661 1.0571 1.0699 1.0699 1.0604 1.0711 1.0424 1.0596 1.0747 1.0765 1.0726 1.0923 1.0736 1.0715 1.0723 1.0710 1.0588 1.0588 1.0591 1.0590 1.0586 1.0367 1.0625 1.0357 1.0357 1.0956 1.0981 1.1012 1.0939 1.0971 1.0872 1.0874 1.1036 1.1022 1.1008 1.0993 1.0984 1.0978 1.1003 1.1002
irintensity: 0.0190 0.0112 0.0465 0.0870 0.0601 0.0320 0.2465 0.1174 0.1038 0.1974 0.0231 0.1907 1.2315 0.0406 0.0054 0.5577 1.5784 0.5298 0.3684 3.0430 1.4871 4.0420 3.1816 4.3247 14.4144 0.0627 10.5190 2.2412 0.8270 4.4122 6.6469 1.7357 4.3293 0.7311 0.5111 5.8041 1.3026 1.4375 4.1825 3.3034 5.0836 15.0635 5.1392 1.4430 22.4087 8.3837 30.6679 5.9556 9.5822 6.3350 9.4639 25.3559 7.1944 5.2217 0.7250 2.6360 0.8742 4.5980 17.1331 7.6983 0.9329 5.3126 5.2199 0.5263 1.0824 0.0433 3.0558 8.1276 1.5563 22.8655 20.0059 11.4678 0.9922 0.2391 0.5270 4.4370 0.4334 2.6879 0.8643 1.3427 12.3509 2.5189 5.7329 1.9785 6.9647 32.7156 14.0916 41.3447 34.0839 247.3028 4.6937 1.5369 0.4112 38.6033 117.3447 35.6487 61.4800 39.7989 26.5905 2.3854 2.0835 2.1056 9.7603 4.5622 12.2312 23.9986 55.7007 143.5428 99.7813 56.1003 40.4519 87.3130 37.4531 48.5122
temp: 298.150 k
press: 1.00000 atm
elementType: 7 6 6 6 6 6 6 6 6 6 6 6 6 1 1 1 1 1 1 1 1 1 1 1 1 1 1 1 1 1 1 1 1 1 1 1 1 1 1 1
symmnumber: 1
zpe: 967840.1 jmol-1
zpe.correction: 0.368631 hartree
zpe.thermalcorrener: 0.386757 hartree
zpe.thermalcorrenthalpy: 0.387702 hartree
zpe.thermalcorrgfe: 0.320399 hartree
zpe.sumelectzpe: -527.090015 hartree
zpe.sumelectthermal: -527.071889 hartree
zpe.sumelectthermalent: -527.070945 hartree
zpe.sumelectthermalfe: -527.138247 hartree
dipole: 0.0984 -0.0495 -0.7956
dipole: 0.8032
quadrupole: -85.4629 -84.5010 -87.1514
quadrupole: 0.0144 -2.1652 -0.9740
quadrupole: 0.2422 1.2041 -1.4463 0.0144 -2.1652 -0.9740
hfenergy: -527.4586462 hartree
pointgroup: C01 [X(C12H27N1)]
dipole: 0.0362418 0.0341139 0.3120402 debye
polarizability: 174.0396387|-0.0922051|131.3441457|-0.1504598|0.056908|117.5797202 unknown
InChI: InChI=1S/C12H27N/c1-4-7-8-9-10-11-12-13(5-2)6-3/h4-12H2,1-3H3
charge 0 multiplicity 1
40 atoms
N  3.262012 -0.062723 0.069089
C  -0.589831 0.414346 0.477145
C  0.7363 -0.141707 -0.089235
C  -1.840421 -0.190406 -0.199867
C  1.976612 0.465265 0.600992
C  -3.169022 0.372771 0.353262
C  -4.420441 -0.241379 -0.313802
C  3.586207 -1.412893 0.60573
C  4.387282 0.897642 0.230043
C  -5.748907 0.327215 0.235448
C  4.511081 -2.223265 -0.323115
C  4.337032 2.056112 -0.785148
C  -6.994067 -0.29492 -0.4330
H  -0.636445 0.220598 1.56976
H  -0.607938 1.518304 0.357166
H  0.742281 -1.245302 0.019175
H  0.805908 0.065781 -1.174582
H  -1.790654 -0.005571 -1.293269
H  -1.828381 -1.293179 -0.071348
H  1.960472 1.559365 0.438045
H  1.898344 0.31212 1.709374
H  -3.184729 1.474572 0.216374
H  -3.21392 0.195919 1.448584
H  -4.40882 -1.342698 -0.172805
H  -4.375136 -0.068985 -1.409738
H  2.636806 -1.96671 0.722537
H  4.039117 -1.346904 1.628989
H  5.330401 0.341823 0.07776
H  4.42805 1.30852 1.272101
H  -5.760728 1.427068 0.091341
H  -5.791644 0.157546 1.330879
H  4.042596 -2.335567 -1.31629
H  5.490593 -1.731045 -0.4641
H  4.700025 -3.228639 0.098333
H  4.355485 1.65704 -1.814239
H  3.420097 2.662695 -0.673266
H  5.203478 2.730341 -0.648316
H  -7.021511 -1.390076 -0.276969
H  -6.989882 -0.113024 -1.524511
H  -7.929905 0.12835 -0.023527
