program: Gaussian 09
title: 000219169
version: EM64L-G09RevD.01
frameworkgroup: C1[X(C16H25NO)]
method: RPBEPBE
basis: SDD
operation: Freq
keyword: #p
keyword: freq=noraman
keyword: PBEPBE/SDD
title: #p freq=noraman PBEPBE/SDD
converged: YES YES NO NO
title: Mulliken charges:
elementType: O N C C C C C C C C C C C C C C C C H H H H H H H H H H H H H H H H H H H H H H H H H
charge: -0.297411 -0.072903 -0.348282 -0.368059 -0.398949 -0.381739 -0.403293 -0.189144 0.452248 -0.236812 -0.381174 -0.416610 -0.363486 -0.344158 -0.244935 -0.242398 -0.241729 -0.689104 0.194852 0.228231 0.200491 0.186970 0.192260 0.199475 0.199517 0.190997 0.213807 0.191736 0.195707 0.174659 0.209910 0.199195 0.204615 0.227410 0.264269 0.191813 0.192640 0.223332 0.222695 0.225764 0.211792 0.210880 0.214921
chargesum: 0.00000
title: Mulliken charges with hydrogens summed into heavy atoms:
elementType: O N C C C C C C C C C C C C C C C C
charge: -0.297411 -0.072903 0.074800 0.019403 -0.007214 0.008775 0.002249 0.006563 0.452248 0.147757 0.022636 -0.189199 -0.099217 0.040295 -0.021603 -0.019703 -0.015964 -0.051511
polarizability: 2.06514247e+02 -1.77665840e+01 1.77365817e+02 -6.65239987e+00 -1.53604110e+01 1.56364217e+02
1716.lowfreq: -5.2218 -0.0008 -0.0007 -0.0006 6.1020 11.0755 26.5057 39.2616 50.0315
frequency: 25.9499 39.2423 50.0147 53.3469 56.8394 74.3077 100.5264 110.8849 145.2382 167.5557 212.6955 224.7055 232.8781 242.1529 250.3269 287.4229 297.5839 354.8823 389.5923 405.4594 425.2727 434.3805 448.6000 501.7773 567.4586 594.9772 617.9703 657.0728 707.1140 738.0056 743.0971 784.4340 806.7709 809.2201 838.5733 850.0477 855.6923 862.3843 889.5399 908.9203 928.9762 938.5851 952.8911 960.4049 977.7653 978.2635 989.9114 995.3389 1008.5870 1025.9778 1042.3462 1044.6399 1076.4696 1077.3153 1084.0692 1092.9042 1123.3263 1125.5247 1147.0932 1148.1763 1154.5590 1170.5084 1183.1997 1195.9480 1207.5561 1213.8907 1257.8738 1262.5189 1265.5080 1268.7099 1286.2930 1290.9080 1300.8631 1318.1262 1330.3026 1334.6493 1339.0852 1346.1104 1347.4539 1362.8320 1369.5902 1381.9557 1386.6235 1391.2896 1438.5349 1450.9445 1458.5402 1465.6272 1469.0460 1470.7761 1475.4315 1478.5484 1478.9464 1480.0663 1486.5046 1495.4043 1592.6054 1612.3883 2852.1356 2877.1251 2916.0078 2926.2427 2965.6243 2965.9268 2974.2445 2981.7534 2981.9640 2986.7312 3002.2584 3009.5385 3010.6450 3032.8552 3042.3489 3048.0535 3051.8127 3053.1696 3072.5351 3073.4120 3112.2157 3124.2300 3137.6900 3155.2865 3168.0213
redmass: 3.5936 3.1590 3.5119 2.5870 2.2885 3.4773 2.9404 1.9460 3.1181 3.1660 3.1665 3.7417 3.9922 1.1314 2.2924 3.8126 2.6443 2.6192 2.3105 2.8467 3.6958 3.1137 2.9548 2.0824 4.3248 3.3960 6.2161 4.0868 1.7837 2.4654 1.0786 2.4638 1.1886 1.4199 2.9349 3.0448 1.3449 1.3694 2.4079 2.0231 1.5420 1.1871 3.2580 1.3100 2.4812 1.5588 5.8196 1.3325 4.7943 2.1845 2.1612 3.6876 1.8658 1.5967 2.1602 1.6090 2.5788 2.8492 1.3219 1.3331 2.3235 1.0641 1.1432 2.1137 1.4247 1.8384 1.2549 1.2336 1.1911 1.2170 1.0838 1.4159 1.4977 1.3029 1.2737 1.3537 1.4551 1.4655 1.4980 1.4692 1.4349 1.5184 4.1751 1.2689 2.1691 1.0932 1.0886 1.0885 1.0828 1.0711 1.0676 1.0423 1.1829 1.9699 1.0733 1.0877 6.1662 6.0956 1.0696 1.0696 1.0824 1.0639 1.0586 1.0627 1.0365 1.0620 1.0614 1.0596 1.0960 1.1008 1.0875 1.0960 1.1013 1.0933 1.1041 1.1020 1.1009 1.0996 1.0866 1.0868 1.0928 1.0969 1.0979
irintensity: 0.1226 0.0917 0.2134 0.1554 0.5729 0.4419 0.5440 0.4076 0.9606 2.3449 4.2885 0.2877 1.9012 0.0312 4.1665 1.5641 3.2345 0.6577 12.1409 0.4059 1.0717 0.6988 1.3075 6.6960 3.8019 6.6618 0.5686 17.5335 54.5308 49.3139 4.8348 9.2823 0.8526 0.0393 3.7202 3.4314 8.0986 8.2545 6.4318 16.7907 5.9353 0.4293 5.4266 2.4463 93.8784 29.4182 4.5000 0.2320 122.7057 6.7719 3.9788 78.6913 24.6241 21.4664 6.3319 22.8409 2.4909 4.4768 1.2355 6.0968 14.6610 0.7235 3.6417 5.5524 1.9476 15.7914 2.0843 1.2319 4.7164 4.1088 0.8025 35.5673 8.3382 17.1027 2.2002 2.2499 1.0306 0.2996 2.9261 10.4765 2.3217 2.6347 2.2420 7.3577 10.4721 5.8486 16.4216 13.4446 2.7146 0.8545 2.2993 12.5443 16.9068 5.3159 10.4860 7.7281 1.1230 5.5557 64.6560 75.2316 28.3783 69.0636 31.8141 36.5643 35.0404 32.2952 35.7674 41.7976 24.3203 1.5832 61.6297 69.8209 33.7114 6.9596 44.6542 81.3786 94.2793 56.0704 10.2734 1.0286 33.0268 34.6366 11.3631
temp: 298.150 k
press: 1.00000 atm
elementType: 8 7 6 6 6 6 6 6 6 6 6 6 6 6 6 6 6 6 1 1 1 1 1 1 1 1 1 1 1 1 1 1 1 1 1 1 1 1 1 1 1 1 1
symmnumber: 1
zpe: 991842.0 jmol-1
zpe.correction: 0.377773 hartree
zpe.thermalcorrener: 0.396336 hartree
zpe.thermalcorrenthalpy: 0.397280 hartree
zpe.thermalcorrgfe: 0.329310 hartree
zpe.sumelectzpe: -753.254533 hartree
zpe.sumelectthermal: -753.235970 hartree
zpe.sumelectthermalent: -753.235025 hartree
zpe.sumelectthermalfe: -753.302995 hartree
dipole: 0.0947 1.5129 -0.5197
dipole: 1.6025
quadrupole: -104.3345 -111.4758 -105.5428
quadrupole: -1.2366 -0.7499 -2.5871
quadrupole: 2.7832 -4.3581 1.5749 -1.2366 -0.7499 -2.5871
hfenergy: -753.6323056 hartree
pointgroup: C01 [X(C16H25N1O1)]
dipole: 0.0735336 -0.5869969 0.2179725 debye
polarizability: 204.3950586|19.447774|178.8445614|6.8296602|-15.5777229|157.0046614 unknown
InChI: InChI=1S/C16H25NO/c1-2-3-14-18-16(15-10-6-4-7-11-15)17-12-8-5-9-13-17/h4,6-7,10-11,16H,2-3,5,8-9,12-14H2,1H3
charge 0 multiplicity 1
43 atoms
O  -1.131309 0.82604 0.115086
N  0.259218 -1.143709 0.278564
C  0.508342 -1.37305 -1.166035
C  1.129839 -1.959159 1.15397
C  0.281617 -2.858715 -1.514113
C  0.931432 -3.463021 0.86354
C  1.171817 -3.766687 -0.633764
C  0.098422 0.275749 0.683632
C  1.240064 1.202812 0.259408
C  -2.355245 0.177454 0.620785
C  -3.546463 0.82027 -0.09541
C  2.398688 1.287994 1.071929
C  1.193991 1.938674 -0.950873
C  -4.900742 0.24426 0.380158
C  3.498271 2.084459 0.679563
C  2.290883 2.73709 -1.34329
C  3.4487 2.810544 -0.532618
C  -6.103227 0.887056 -0.344075
H  1.549774 -1.083862 -1.451722
H  -0.184182 -0.727453 -1.734583
H  0.876508 -1.736571 2.208986
H  2.211558 -1.706377 1.010136
H  0.50111 -3.02096 -2.587105
H  -0.783977 -3.111013 -1.347063
H  -0.104119 -3.745867 1.135998
H  1.620823 -4.05414 1.497225
H  0.973129 -4.833879 -0.848385
H  2.238359 -3.580484 -0.879432
H  0.035605 0.259817 1.796555
H  -2.423597 0.335321 1.721357
H  -2.301861 -0.913155 0.430181
H  -3.4346 0.664666 -1.186487
H  -3.522292 1.91424 0.075024
H  2.438474 0.740103 2.022237
H  0.284217 1.898374 -1.55734
H  -5.002505 0.398483 1.473994
H  -4.913704 -0.852891 0.217173
H  4.385019 2.145657 1.320851
H  2.241009 3.308736 -2.277332
H  4.297437 3.433385 -0.837433
H  -6.125955 1.980501 -0.177823
H  -6.045589 0.715765 -1.435522
H  -7.062137 0.469542 0.014154
