program: Gaussian 09
title: 000219166
version: EM64L-G09RevD.01
frameworkgroup: C1[X(C11H13NO)]
method: RPBEPBE
basis: SDD
operation: Freq
keyword: #p
keyword: freq=noraman
keyword: PBEPBE/SDD
title: #p freq=noraman PBEPBE/SDD
converged: YES YES NO NO
title: Mulliken charges:
elementType: O N C C C C C C C C C C C H H H H H H H H H H H H H
charge: -0.263694 -0.018774 0.117016 0.469749 -0.689647 -0.689141 -0.368810 -0.403187 -0.363224 -0.385196 -0.231351 0.321696 -0.537032 0.241812 0.219997 0.227836 0.241637 0.220422 0.227821 0.255124 0.224221 0.253203 0.240646 0.220722 0.220704 0.247452
chargesum: 0.00000
title: Mulliken charges with hydrogens summed into heavy atoms:
elementType: O N C C C C C C C C C C C
charge: -0.263694 -0.018774 0.117016 0.469749 -0.000003 0.000738 -0.113686 -0.178966 -0.110020 -0.144550 -0.231351 0.321696 0.151845
polarizability: 1.73062402e+02 5.52925888e+00 1.24015547e+02 -2.39291865e-02 3.71137924e-02 7.60273861e+01
1716.lowfreq: -11.5655 -7.0949 -0.0010 -0.0007 -0.0006 4.0468 35.4113 63.3287 116.4849
frequency: 35.1900 63.2271 116.4835 118.6831 180.2724 181.3387 197.4088 223.9377 249.5386 254.5977 270.8573 285.1027 379.0277 405.9669 413.2117 415.7373 477.1280 531.8063 574.7418 578.1345 626.9610 633.3120 737.2147 767.1325 811.9653 832.2887 840.9387 927.9812 930.9916 937.8316 969.7087 987.9353 1000.8070 1017.1609 1103.4562 1110.5959 1116.7783 1126.7493 1156.3099 1183.1445 1196.7563 1235.0024 1243.8419 1308.2263 1369.5040 1379.2901 1398.9893 1416.4140 1434.5689 1460.7419 1464.3533 1465.7165 1471.2783 1475.0760 1482.5968 1501.8784 1582.3762 1622.6612 2186.0845 2958.0341 2992.6302 2994.5753 3045.6213 3092.3687 3096.9253 3102.6108 3105.7323 3124.3963 3125.8975 3142.0463 3161.7922 3169.7031
redmass: 3.7373 3.3891 7.7100 3.9729 3.5029 2.4707 1.5754 1.1866 1.1378 1.9124 2.8445 3.0054 3.3673 4.7510 4.7150 2.9952 4.2812 2.8847 4.0015 5.9864 4.9885 6.7511 3.6405 4.9696 1.3561 2.6669 1.5052 2.3472 1.6087 1.3609 1.3465 8.6941 2.8520 1.2806 2.0659 1.2607 1.3884 3.5193 1.3412 1.2981 2.3928 2.5868 3.5758 1.2871 6.2702 1.1694 1.1984 3.5046 1.1723 1.0477 1.0485 1.0504 1.0730 1.0503 1.1087 2.1377 7.1524 6.3248 12.6451 1.0331 1.0342 1.0346 1.1040 1.1010 1.1003 1.1014 1.1010 1.0933 1.0941 1.0889 1.0939 1.0958
irintensity: 0.0350 1.4966 2.5256 6.4161 3.3673 1.6368 0.3106 0.0167 0.8109 0.5299 2.3695 0.6446 0.3049 0.9875 1.5195 0.0014 2.3003 15.6280 13.2255 8.9035 2.5115 1.8065 1.5836 8.3993 22.0624 0.9135 52.1696 2.1120 1.0468 0.0024 0.0035 43.2738 14.9479 0.1180 14.2333 0.1703 14.4273 4.6336 0.4173 86.8422 3.9996 106.7447 82.3305 1.0479 17.1364 15.0128 10.3082 1.3836 9.3143 4.6464 1.5555 13.8718 54.7413 12.1988 7.0786 137.7548 4.5429 47.3103 9.3797 65.6865 16.7431 22.7959 49.6866 0.5248 63.7393 13.5843 20.5154 41.2356 1.6483 3.9233 13.8458 3.4904
temp: 298.150 k
press: 1.00000 atm
elementType: 8 7 6 6 6 6 6 6 6 6 6 6 6 1 1 1 1 1 1 1 1 1 1 1 1 1
symmnumber: 1
zpe: 553747.5 jmol-1
zpe.correction: 0.210911 hartree
zpe.thermalcorrener: 0.224224 hartree
zpe.thermalcorrenthalpy: 0.225169 hartree
zpe.thermalcorrgfe: 0.171204 hartree
zpe.sumelectzpe: -555.956438 hartree
zpe.sumelectthermal: -555.943125 hartree
zpe.sumelectthermalent: -555.942180 hartree
zpe.sumelectthermalfe: -555.996145 hartree
dipole: -3.0514 -4.8117 0.0264
dipole: 5.6977
quadrupole: -76.7393 -78.2948 -79.0619
quadrupole: -5.9598 0.0808 0.0693
quadrupole: 1.2927 -0.2628 -1.0299 -5.9598 0.0808 0.0693
hfenergy: -556.167349 hartree
pointgroup: C01 [X(C11H13N1O1)]
dipole: 1.206089 -1.8636553 -0.3116582 debye
dipolederiv: -1.8092341 0.1372247 -0.108894 0.0010574 -0.316843 -0.0039819 -0.1385016 0.0082327 -0.3096776 -0.299902 0.0496925 0.0042229 0.0599435 -0.275487 -0.0073465 0.0064324 -0.0076406 -0.2221588 0.340077 -0.0162137 0.0059934 -0.046382 0.1203265 -0.0298523 -0.0045188 -0.027228 0.2268129 0.1839462 0.058021 0.044339 0.0708268 -0.233384 -0.0138255 0.0501915 -0.0149339 -0.1369878 -0.0763408 0.0286434 0.0081398 0.0217918 -0.0005615 0.0169713 -0.0099641 -0.01831 0.0076343 -0.0774872 0.0287474 -0.0105291 0.0216106 -0.001609 -0.0169736 0.0050369 0.0203416 0.008065 0.0448761 0.028661 0.0213542 0.0087042 0.0923803 0.0466679 0.0162848 0.048843 -0.1062612 0.0465553 -0.0681617 0.0003865 0.0154097 0.1065722 0.0504548 0.0187132 0.042578 -0.1084822 -0.4047884 -0.0238626 -0.0270893 0.229238 0.0588987 0.0703381 0.0284269 0.0468697 -0.1528887 -0.3049885 0.025987 -0.0028918 -0.3395123 -0.0500963 0.0039584 -0.082906 0.0375694 -0.2103394 0.0072314 -0.1298048 -0.0194494 -0.1485496 0.1125376 0.0365624 -0.0228703 0.0372825 -0.0991616 1.5662793 0.0371895 0.1427797 0.3172795 0.0249148 0.0121974 0.2039686 -0.0133588 0.1170502 0.6949253 -0.1389132 0.0032714 -0.4795021 0.3594751 -0.0370473 -0.0717994 -0.0056649 0.3197417 0.1122635 -0.0147541 -0.0395868 -0.0076518 0.0661951 -0.0652508 -0.0270609 -0.0277785 -0.1061885 0.0636717 0.1141638 0.0253297 0.106409 -0.0827644 -0.0032747 0.0195561 -0.0288253 0.0705524 -0.1820977 -0.0692305 -0.014272 -0.0648976 0.0840771 0.0188827 -0.0260395 0.0033616 0.0826456 0.0948001 -0.0484509 0.0582609 -0.0434435 -0.0000935 0.1077749 0.0492213 0.0686042 -0.0223064 0.0627014 0.1126383 0.0245865 0.1078429 -0.0754267 -0.0451979 0.0280635 -0.0179607 0.0637222 -0.1759668 -0.0559769 -0.0630214 -0.0548667 0.0978811 -0.0237064 -0.0511593 -0.0090781 0.0616527 0.0585416 0.0797607 0.0097157 0.0884564 0.013966 -0.0194269 0.0113824 -0.0201301 0.1371789 0.0593608 -0.0850072 -0.0253571 -0.1009715 -0.0645544 -0.0520258 -0.0290536 -0.050671 0.1179942 0.0601108 -0.0562912 -0.0223425 -0.0627459 -0.0182174 -0.0465776 -0.023521 -0.0459383 0.1561634 -0.0088024 0.0949442 0.0046485 0.107733 -0.0028488 -0.0266292 0.0076188 -0.0277235 0.1593767 0.044968 -0.0015761 -0.0456158 0.1476968 0.0052858 -0.0757542 0.0586999 -0.090847 -0.1349769 0.0374049 -0.0444968 0.0591795 0.1346885 -0.0872797 0.1236651 0.0272276 0.1087021 -0.0351563 -0.1381053 -0.0429338 -0.0331584 -0.090165 0.0666555 -0.0206024 -0.0434295 -0.0162963 0.1159953 unknown
polarizability: 172.3363343|-7.0061965|121.9748334|7.3300683|9.4851832|78.7941677 unknown
InChI: InChI=1S/C11H13NO/c1-11(2,8-12)9-4-6-10(13-3)7-5-9/h4-7H,1-3H3
charge 0 multiplicity 1
26 atoms
O  3.570687 0.583536 0.385976
N  -3.52773 1.878353 0.028885
C  -2.104225 -0.358239 -0.348357
C  -0.588888 -0.108127 -0.14937
C  -2.631594 -1.413962 0.67881
C  -2.396438 -0.843577 -1.807134
C  -0.063751 1.168943 0.178162
C  0.320781 -1.182652 -0.299395
C  1.31907 1.365584 0.349713
C  1.711661 -1.004547 -0.13195
C  -2.874696 0.893252 -0.134579
C  2.214285 0.279825 0.195039
C  4.538061 -0.505516 0.233895
H  -2.452063 -1.078429 1.714019
H  -2.107822 -2.373834 0.529448
H  -3.714202 -1.582453 0.542178
H  -2.046011 -0.102052 -2.544492
H  -1.871123 -1.795724 -1.995819
H  -3.478589 -1.007245 -1.953475
H  -0.740437 2.021679 0.301044
H  -0.045914 -2.184737 -0.551746
H  1.725255 2.349501 0.602401
H  2.381798 -1.860295 -0.256797
H  4.514996 -0.925589 -0.79071
H  4.356466 -1.312595 0.970395
H  5.519222 -0.046202 0.423259
