program: Gaussian 09
title: 000219165
version: EM64L-G09RevD.01
frameworkgroup: C1[X(C8H17NO2)]
method: RPBEPBE
basis: SDD
operation: Freq
keyword: #p
keyword: freq=noraman
keyword: PBEPBE/SDD
title: #p freq=noraman PBEPBE/SDD
converged: YES YES NO NO
title: Mulliken charges:
elementType: O O N C C C C C C C C H H H H H H H H H H H H H H H H H
charge: -0.267788 -0.245343 -0.108919 -0.351244 -0.316358 -0.321607 -0.496143 -0.676203 -0.673512 0.246412 -0.506762 0.233070 0.199014 0.189138 0.201874 0.188682 0.202887 0.239033 0.259534 0.227249 0.208717 0.206392 0.225937 0.214342 0.206608 0.233051 0.240808 0.241132
chargesum: 0.00000
title: Mulliken charges with hydrogens summed into heavy atoms:
elementType: O O N C C C C C C C C
charge: -0.267788 -0.245343 -0.108919 0.080841 0.074653 0.069962 0.002424 -0.033845 -0.026625 0.246412 0.208228
polarizability: 1.24622362e+02 1.99267131e+00 1.01640988e+02 -3.24919666e-01 2.64123089e+00 8.08977912e+01
1716.lowfreq: -6.1760 -0.0012 -0.0012 -0.0008 5.0186 8.3680 19.7485 39.9253 58.5842
frequency: 19.5217 39.8253 58.4950 77.8177 83.5266 100.1068 117.3653 177.7930 194.7785 200.9117 240.8651 267.2416 282.6077 305.5981 352.4119 428.2168 457.5299 480.6513 572.8986 661.2948 740.7488 780.0652 793.5514 795.7997 845.0952 911.1579 954.9850 989.6467 1039.1522 1050.9191 1073.6558 1082.3715 1085.4550 1106.4965 1112.2611 1134.8254 1147.7280 1161.2765 1204.9129 1217.2381 1273.6358 1289.6479 1291.5966 1310.9886 1360.8790 1365.8324 1383.4986 1386.4757 1387.4523 1421.9640 1443.4757 1452.7394 1462.2194 1462.9274 1464.3465 1470.7934 1477.4674 1480.6449 1486.6566 1490.6848 1642.2600 2850.9812 2858.6970 2879.0788 2983.0663 2983.4229 3002.8987 3004.2886 3028.5816 3036.3964 3058.5341 3074.5765 3076.6954 3079.8297 3091.7194 3091.9993 3105.0315 3148.3001
redmass: 5.9142 3.2729 2.4910 2.2511 2.0453 1.0817 2.4399 1.8320 1.7837 1.6614 2.0480 2.3122 2.1073 3.0052 3.1035 2.9746 3.1028 2.6188 3.0876 4.4500 2.9655 1.3433 1.2347 1.1363 4.5021 2.0008 5.3527 2.3409 1.8693 3.0285 1.9096 2.5689 2.2283 1.8842 1.2771 2.5257 1.4391 1.7119 2.2462 1.7371 1.1514 1.2575 1.1946 1.5564 1.3341 1.3436 1.4347 1.2351 1.2329 1.1922 1.0820 1.0503 1.0542 1.0555 1.0505 1.0571 1.0604 1.0670 1.0661 1.0747 9.0078 1.0723 1.0720 1.0717 1.0358 1.0357 1.0510 1.0406 1.0867 1.0875 1.0897 1.0986 1.0979 1.0951 1.1004 1.1003 1.1045 1.1047
irintensity: 1.7930 0.0884 0.1181 0.1344 0.2768 0.3089 2.4941 2.2820 3.2322 5.9111 3.9114 9.1891 3.2093 5.4240 6.1182 6.0722 0.8588 8.0223 4.2414 10.9440 5.0950 9.1448 13.5435 4.9943 8.9018 0.6020 25.2218 14.8716 19.7285 40.1882 25.7046 16.0582 10.5983 17.7912 2.4194 168.0632 5.0144 104.6033 11.2393 25.4043 11.0391 13.4490 15.6540 72.6350 4.4308 14.6535 16.4163 22.3363 20.3365 23.1261 16.8295 14.0451 2.0007 5.0260 11.1062 3.9741 2.8424 19.4914 10.1381 12.9715 161.1401 33.2285 108.8179 149.6640 40.8448 22.3688 25.7899 18.0141 16.9023 18.7452 1.5265 11.9133 91.4792 33.1962 33.7713 50.9326 28.5721 17.1166
temp: 298.150 k
press: 1.00000 atm
elementType: 8 8 7 6 6 6 6 6 6 6 6 1 1 1 1 1 1 1 1 1 1 1 1 1 1 1 1 1
symmnumber: 1
zpe: 637053.8 jmol-1
zpe.correction: 0.242641 hartree
zpe.thermalcorrener: 0.256993 hartree
zpe.thermalcorrenthalpy: 0.257937 hartree
zpe.thermalcorrgfe: 0.199465 hartree
zpe.sumelectzpe: -519.312431 hartree
zpe.sumelectthermal: -519.298079 hartree
zpe.sumelectthermalent: -519.297135 hartree
zpe.sumelectthermalfe: -519.355608 hartree
dipole: 0.0134 -1.3639 0.1421
dipole: 1.3714
quadrupole: -57.5678 -71.7012 -69.6121
quadrupole: 3.9792 2.8870 -2.5158
quadrupole: 8.7259 -5.4075 -3.3184 3.9792 2.8870 -2.5158
hfenergy: -519.5550722 hartree
pointgroup: C01 [X(C8H17N1O2)]
dipole: -0.0028282 0.5359143 -0.06242 debye
polarizability: 124.6668491|-1.6467773|101.6549788|-0.4898091|2.4212489|80.8393139 unknown
InChI: InChI=1S/C8H17NO2/c1-4-9(5-2)7-6-8(10)11-3/h4-7H2,1-3H3
charge 0 multiplicity 1
28 atoms
O  -3.107489 0.723714 0.392391
O  -2.404668 -1.334619 -0.439253
N  1.712601 0.059137 -0.077788
C  0.352027 -0.35244 -0.505645
C  2.092756 1.40048 -0.603216
C  2.74036 -0.979737 -0.365458
C  -0.739087 0.319511 0.355335
C  3.157203 2.106741 0.258193
C  2.683216 -2.168179 0.613269
C  -2.125812 -0.21244 0.043816
C  -4.510518 0.288414 0.184532
H  0.251815 -1.444768 -0.390595
H  0.167387 -0.133424 -1.586471
H  2.444782 1.335064 -1.66463
H  1.183288 2.029421 -0.618109
H  2.659568 -1.351166 -1.41888
H  3.733092 -0.502308 -0.278272
H  -0.744594 1.417944 0.24849
H  -0.515867 0.111408 1.420106
H  2.790927 2.224472 1.292801
H  4.10339 1.537368 0.296219
H  3.386253 3.10722 -0.154359
H  2.815759 -1.811418 1.649494
H  1.718668 -2.704373 0.557742
H  3.482957 -2.89669 0.382548
H  -5.120702 1.136907 0.524252
H  -4.722633 -0.617697 0.776831
H  -4.688779 0.070856 -0.882043
