program: Gaussian 09
title: 000219163
version: EM64L-G09RevD.01
frameworkgroup: C1[X(C20H23NO)]
method: RPBEPBE
basis: SDD
operation: Freq
keyword: #p
keyword: freq=noraman
keyword: PBEPBE/SDD
title: #p freq=noraman PBEPBE/SDD
converged: YES YES NO NO
title: Mulliken charges:
elementType: O N C C C C C C C C C C C C C C C C C C C C H H H H H H H H H H H H H H H H H H H H H H H
charge: -0.235471 -0.137950 -0.143247 -0.363422 -0.347864 -0.407809 -0.403210 -0.400131 -0.621403 0.426178 0.156977 -0.427379 -0.390291 0.297057 -0.232875 -0.242855 -0.244579 -0.339229 -0.350990 -0.249706 -0.229503 -0.224996 0.237202 0.243703 0.174452 0.174370 0.193097 0.204921 0.193297 0.191278 0.202696 0.190648 0.213568 0.254104 0.240348 0.256176 0.261051 0.223281 0.221192 0.224616 0.239349 0.277096 0.230229 0.232870 0.233154
chargesum: 0.00000
title: Mulliken charges with hydrogens summed into heavy atoms:
elementType: O N C C C C C C C C C C C C C C C C C C C C
charge: -0.235471 -0.137950 0.093955 0.054733 0.019603 -0.009591 -0.009236 0.004085 -0.126951 0.426178 0.156977 -0.171203 -0.129240 0.297057 -0.009594 -0.021663 -0.019963 -0.099880 -0.073894 -0.019477 0.003368 0.008158
polarizability: 2.52352272e+02 -5.52226741e+00 2.11364275e+02 -2.10064226e+00 -1.62999477e+01 1.91383131e+02
1716.lowfreq: -10.7255 -5.5594 -0.0007 -0.0006 0.0003 8.1325 12.0817 21.4055 31.6111
frequency: 9.9394 21.2741 31.4931 47.5061 50.7168 66.5452 87.1294 116.9654 150.6188 183.2789 192.7972 200.6242 221.6131 263.1660 298.2643 306.4706 314.5862 391.9974 399.3156 406.6411 411.3748 412.9100 440.9615 459.5643 490.9240 544.9296 567.9354 578.0480 607.6475 613.6765 617.8114 650.2445 695.8377 707.5867 744.5395 754.8982 773.9945 786.0099 803.6224 823.3794 854.6644 857.7184 859.2320 864.9206 908.4503 926.4365 934.5460 955.3860 958.8383 973.0247 981.2206 989.2959 990.4669 992.1554 992.5615 997.5928 1010.2157 1024.9238 1026.9207 1045.3584 1057.5975 1077.2910 1084.0119 1087.3237 1099.1394 1119.2820 1143.9158 1149.6322 1160.7705 1169.7025 1172.9991 1182.5347 1189.5856 1199.7290 1214.2011 1223.8778 1257.3581 1270.4226 1283.6731 1286.7750 1301.2315 1313.6856 1332.3169 1336.4212 1340.8552 1346.3008 1352.6131 1356.8885 1379.3410 1387.3883 1389.5849 1428.7654 1435.4524 1441.7866 1451.5652 1461.2930 1464.4290 1466.3990 1478.4956 1479.4585 1480.4903 1566.4916 1592.7654 1596.9939 1611.8372 1612.6428 2826.3753 2837.1937 2891.5447 2968.1834 2980.2091 2983.8355 2984.9522 3032.0093 3042.1313 3044.6554 3052.8222 3053.1872 3066.4048 3116.7386 3124.9166 3128.4585 3136.6786 3138.5738 3146.2982 3150.3441 3159.5227 3160.8284 3169.6176
redmass: 5.0205 4.1760 2.9999 4.1211 3.5974 4.8279 5.1058 3.3137 5.0499 4.9267 2.9748 3.8855 2.0553 3.5282 2.2825 3.8007 4.6660 2.0008 2.7565 2.8152 3.7452 3.4527 2.9460 3.2395 3.3058 2.7546 2.6451 2.6639 4.7134 6.3639 6.1339 4.9005 1.8138 1.7388 3.7193 2.0944 2.2202 2.5138 1.4938 3.7344 1.4464 1.2619 1.2626 2.7237 2.3817 1.5760 1.5312 1.3460 1.9357 3.4440 1.4980 3.9933 1.5779 3.9458 2.2570 1.6696 1.3546 2.2389 2.0751 2.2900 2.0661 1.6346 1.6293 1.7758 2.4716 2.6941 2.0485 1.4125 1.4029 1.0586 1.0683 1.1111 1.1367 1.9560 1.8093 2.1073 1.2684 1.1826 1.2828 1.6267 1.5309 1.3462 1.2850 1.4289 1.4074 1.4667 1.4792 1.4774 1.9985 9.0292 2.5245 1.1235 2.1899 2.1064 1.0888 1.0872 1.0837 1.0979 1.2635 1.7385 2.3109 7.1840 6.1075 6.7058 6.3622 6.2013 1.0720 1.0707 1.0815 1.0619 1.0629 1.0612 1.0614 1.0965 1.0947 1.0944 1.1025 1.0940 1.0878 1.0847 1.0873 1.0850 1.0924 1.0881 1.0960 1.0924 1.0958 1.1013 1.1011
irintensity: 0.1195 0.7612 1.0247 1.3807 0.1987 1.1526 2.2793 1.5439 0.4642 1.6054 3.9845 0.4236 0.6862 0.5674 3.1638 1.7392 4.1742 1.4482 0.1822 0.3517 0.5555 0.4250 0.2929 1.3731 0.6278 6.8299 31.1717 16.7279 0.4404 0.9013 0.0084 9.2661 47.2363 61.1699 6.1350 53.0857 22.5666 14.1756 0.0629 17.2019 5.1461 0.8628 0.2858 14.6517 2.7572 6.6134 5.7581 2.4944 10.4276 60.4265 0.3674 4.0353 0.7815 2.1695 4.1242 4.3520 0.2097 7.0462 3.7840 9.5508 6.2785 16.7847 13.5488 6.7900 37.3499 6.1152 17.1219 11.7510 2.4921 0.4447 3.5840 2.8520 26.4831 30.7478 3.1248 93.0557 4.4567 4.5878 24.2490 84.5625 24.5268 2.0207 3.0576 56.4955 36.2529 5.4963 1.5601 7.8850 0.3646 2.8676 4.0516 13.0220 24.1103 10.3214 6.6059 13.8510 2.7601 11.3679 2.5663 1.6122 14.9634 90.8937 1.9905 27.6092 7.5138 5.2500 38.3820 134.3543 36.6132 40.0370 36.9960 36.4088 34.5800 84.8608 76.9691 7.7567 95.6335 6.1329 22.8938 1.8420 1.9447 0.2218 19.8904 6.7165 30.2038 19.6988 19.5698 25.1762 22.5867
temp: 298.150 k
press: 1.00000 atm
elementType: 8 7 6 6 6 6 6 6 6 6 6 6 6 6 6 6 6 6 6 6 6 6 1 1 1 1 1 1 1 1 1 1 1 1 1 1 1 1 1 1 1 1 1 1 1
symmnumber: 1
zpe: 995422.0 jmol-1
zpe.correction: 0.379136 hartree
zpe.thermalcorrener: 0.398799 hartree
zpe.thermalcorrenthalpy: 0.399744 hartree
zpe.thermalcorrgfe: 0.327632 hartree
zpe.sumelectzpe: -904.285937 hartree
zpe.sumelectthermal: -904.266274 hartree
zpe.sumelectthermalent: -904.265330 hartree
zpe.sumelectthermalfe: -904.337441 hartree
dipole: -0.8012 -1.5890 1.8494
dipole: 2.5665
quadrupole: -116.3802 -125.3394 -129.8981
quadrupole: 0.7015 -4.7146 -2.6672
quadrupole: 7.4924 -1.4668 -6.0255 0.7015 -4.7146 -2.6672
hfenergy: -904.6650736 hartree
pointgroup: C01 [X(C20H23N1O1)]
dipole: -0.2434234 -0.575943 0.7928704 debye
polarizability: 253.0453791|-1.3150315|207.0866902|-0.6453209|-18.0513239|194.967609 unknown
InChI: InChI=1S/C20H23NO/c22-20(18-12-6-2-7-13-18)16-19(17-10-4-1-5-11-17)21-14-8-3-9-15-21/h1-2,4-7,10-13,19H,3,8-9,14-16H2
charge 0 multiplicity 1
45 atoms
O  -1.390399 -0.231385 -1.94548
N  2.363711 -0.530447 0.099314
C  1.074854 -0.055535 -0.514429
C  3.52086 0.267938 -0.407986
C  2.631389 -1.979499 -0.123792
C  4.828061 -0.105999 0.317105
C  3.912985 -2.435816 0.605772
C  5.136764 -1.610059 0.156002
C  -0.141679 -0.832244 0.062047
C  0.862158 1.439929 -0.24193
C  -1.428782 -0.627868 -0.742128
C  0.448341 2.314617 -1.274894
C  1.029155 1.956483 1.069373
C  -2.747382 -0.962506 -0.098151
C  0.208139 3.682177 -1.005253
C  0.792638 3.321224 1.340498
C  0.37942 4.190751 0.302348
C  -2.849869 -1.511309 1.208935
C  -3.935919 -0.731606 -0.844049
C  -4.113119 -1.823204 1.755766
C  -5.196553 -1.036846 -0.295913
C  -5.28895 -1.584916 1.006934
H  1.081549 -0.210713 -1.620795
H  3.303525 1.337965 -0.258718
H  3.652791 0.106458 -1.511071
H  2.729461 -2.201924 -1.220024
H  1.786014 -2.578089 0.256554
H  4.721341 0.139421 1.3918
H  5.654897 0.510296 -0.085667
H  4.072964 -3.514478 0.413236
H  3.762275 -2.308592 1.695526
H  5.358631 -1.828636 -0.909185
H  6.034053 -1.893097 0.738402
H  -0.285375 -0.547204 1.119192
H  0.045304 -1.925041 0.055385
H  0.297238 1.916417 -2.284398
H  1.374814 1.280849 1.861016
H  -0.113819 4.347359 -1.814686
H  0.93189 3.708958 2.356447
H  0.194342 5.250775 0.510855
H  -1.950261 -1.702177 1.802976
H  -3.836632 -0.312134 -1.850724
H  -4.18241 -2.248087 2.763121
H  -6.106276 -0.850646 -0.877137
H  -6.269243 -1.823559 1.434602
