program: Gaussian 09
title: 000219160
version: EM64L-G09RevD.01
frameworkgroup: C1[X(C20H17NO)]
method: RPBEPBE
basis: SDD
operation: Freq
keyword: #p
keyword: freq=noraman
keyword: PBEPBE/SDD
title: #p freq=noraman PBEPBE/SDD
converged: YES YES NO NO
title: Mulliken charges:
elementType: O N C C C C C C C C C C C C C C C C C C C C H H H H H H H H H H H H H H H H H
charge: -0.282954 -0.429077 -0.315866 0.484505 0.378724 -0.388270 -0.372796 -0.416514 -0.419434 0.176766 0.265868 -0.238325 -0.240224 -0.235209 -0.227877 -0.242977 -0.247669 -0.354177 -0.354823 -0.224052 -0.238252 -0.227279 0.273028 0.309587 0.253883 0.253044 0.253689 0.253183 0.226695 0.226939 0.228553 0.225784 0.230049 0.229289 0.276041 0.215289 0.232563 0.229755 0.232541
chargesum: 0.00000
title: Mulliken charges with hydrogens summed into heavy atoms:
elementType: O N C C C C C C C C C C C C C C C C C C C C
charge: -0.282954 -0.119490 -0.042838 0.484505 0.378724 -0.134387 -0.119752 -0.162825 -0.166251 0.176766 0.265868 -0.011630 -0.013285 -0.006656 -0.002093 -0.012928 -0.018380 -0.078137 -0.139534 0.008510 -0.008496 0.005262
polarizability: 2.65360920e+02 1.12017292e+01 2.16039875e+02 -8.35580322e+00 3.06698019e+00 1.76419585e+02
1716.lowfreq: -8.0076 -3.9604 -0.0002 0.0004 0.0005 5.7012 15.8441 21.5053 28.0949
frequency: 14.2362 21.1906 28.0802 41.5597 49.2453 62.4163 76.3763 137.3501 157.7282 205.0653 221.0506 232.7787 285.1184 298.6645 326.5025 398.5980 402.3763 405.5703 407.6299 429.6353 464.2064 494.2331 553.1158 574.0072 611.6248 614.8571 615.1995 617.3280 631.3224 664.7270 686.6844 702.4751 706.4471 708.7554 742.4129 771.0998 792.3402 793.8212 854.4492 857.3769 859.8706 863.2987 890.5418 930.6926 934.6675 938.4357 981.5666 984.2533 986.1140 989.6399 990.5896 991.5840 997.8555 998.9970 1006.1675 1017.9248 1026.0982 1029.1119 1038.5815 1081.3218 1084.1205 1088.8428 1131.5158 1172.3509 1173.0713 1173.4084 1186.7108 1190.1909 1190.9545 1193.0647 1218.0804 1250.7751 1272.9814 1307.6369 1317.2866 1323.7781 1343.2635 1380.2307 1383.6821 1384.7575 1431.8432 1435.1484 1443.4963 1463.1374 1481.5423 1483.3957 1490.9845 1568.5179 1589.5916 1594.1617 1603.9948 1610.9479 1611.3393 1614.4319 2994.8426 3117.8195 3118.7637 3122.5635 3124.2964 3129.2732 3131.6916 3135.2475 3141.9516 3144.9925 3146.4863 3149.5140 3158.1762 3163.3034 3164.2786 3169.6895 3552.3457
redmass: 4.4488 4.0512 4.9686 4.8859 5.1047 5.2289 4.5418 4.8588 4.7823 5.3891 5.2110 4.7578 5.8683 5.0113 4.4265 4.0015 2.8352 3.8187 2.8815 3.8599 3.5708 4.0508 1.4742 3.2179 4.4050 5.7952 5.1463 6.2091 5.1453 6.2256 4.8577 1.5399 1.8419 1.9460 1.9389 1.9553 3.0996 2.6034 1.2640 1.3133 3.2432 1.2792 3.1724 1.4945 1.4476 1.5982 1.4400 1.4256 1.5727 5.2675 4.7887 4.2373 1.3357 1.3160 1.3422 3.7716 2.3324 2.1695 2.5777 1.6046 1.5937 1.6627 3.0523 1.0522 1.0609 1.0588 1.9470 1.1321 1.1499 1.3551 2.4122 1.7170 1.5945 1.5629 1.3393 1.3748 1.3074 7.2255 6.2158 8.9395 2.2179 2.2355 2.1332 1.9285 2.2391 2.2628 2.2859 6.5109 5.9998 6.2064 6.6509 5.9986 6.0587 6.0557 1.0816 1.0871 1.0859 1.0844 1.0874 1.0875 1.0871 1.0918 1.0919 1.0920 1.0961 1.0960 1.0958 1.1015 1.1015 1.1005 1.0772
irintensity: 1.2157 0.2596 0.3627 2.9075 3.0201 1.8531 0.4279 0.2916 2.0717 2.0505 1.1102 3.0243 14.0975 0.1222 1.5461 0.6683 0.1019 0.2457 0.1411 2.1687 6.9701 1.4143 56.4134 74.2714 36.6902 12.7533 21.0005 3.0480 9.5785 4.3438 5.0621 81.9178 87.0280 32.4065 40.9311 38.6658 8.0235 20.5568 2.4567 0.4574 16.4462 1.5365 3.3287 3.1530 2.2645 1.3832 0.2466 1.8152 0.1696 0.9028 0.9147 0.5458 0.4698 0.0261 1.8344 0.5229 10.6791 14.5214 6.6704 4.3913 29.2426 4.6614 16.3762 0.6183 0.2038 1.3499 13.8842 3.5508 7.6432 7.0261 9.0855 40.7711 18.8363 110.0292 5.0851 37.5998 8.3766 1.1403 0.5414 1.4088 7.1043 8.6243 8.7088 246.0572 9.9514 28.7537 144.1150 99.7368 1.3554 0.3969 46.7426 7.7891 4.8070 10.2066 24.8056 12.3151 5.6728 1.9195 0.1942 1.0349 2.2030 13.4238 17.8251 22.6513 32.0920 37.9279 15.9567 31.0733 20.5578 21.8208 10.2445
temp: 298.150 k
press: 1.00000 atm
elementType: 8 7 6 6 6 6 6 6 6 6 6 6 6 6 6 6 6 6 6 6 6 6 1 1 1 1 1 1 1 1 1 1 1 1 1 1 1 1 1
symmnumber: 1
zpe: 819737.7 jmol-1
zpe.correction: 0.312222 hartree
zpe.thermalcorrener: 0.330504 hartree
zpe.thermalcorrenthalpy: 0.331448 hartree
zpe.thermalcorrgfe: 0.261860 hartree
zpe.sumelectzpe: -900.802994 hartree
zpe.sumelectthermal: -900.784712 hartree
zpe.sumelectthermalent: -900.783767 hartree
zpe.sumelectthermalfe: -900.853356 hartree
dipole: 0.0165 0.2398 -3.6118
dipole: 3.6198
quadrupole: -111.1766 -120.1367 -129.0912
quadrupole: 3.2895 3.8142 0.8931
quadrupole: 8.9582 -0.0018 -8.9564 3.2895 3.8142 0.8931
hfenergy: -901.1152155 hartree
pointgroup: C01[X(C20H17N1O1)]
dipole: 0.0745811 -0.2842447 1.3934779 debye
polarizability: 268.1417091|-2.5453596|211.7742295|4.0394665|9.4615438|177.9044426 unknown
InChI: InChI=1S/C20H17NO/c22-20(18-14-8-3-9-15-18)21-19(16-10-4-1-5-11-16)17-12-6-2-7-13-17/h1-15,19,21H
charge 0 multiplicity 1
39 atoms
O  -1.50345 0.112025 -2.09325
N  -0.452708 0.084241 -0.018946
C  0.903555 0.279915 -0.578134
C  1.714581 -1.01572 -0.412133
C  1.577528 1.545572 -0.023966
C  2.394254 -1.321492 0.794913
C  2.979308 1.72562 -0.157631
C  1.714762 -1.970566 -1.459264
C  0.81129 2.593483 0.543998
C  -1.56985 -0.046278 -0.831333
C  -2.873418 -0.358397 -0.139431
C  3.057997 -2.558432 0.951466
C  3.598318 2.917683 0.276521
C  2.381573 -3.206833 -1.306836
C  1.430271 3.785556 0.984854
C  3.054344 -3.505611 -0.099379
C  2.827128 3.95275 0.854963
C  -4.069609 -0.056225 -0.839113
C  -2.954842 -0.959622 1.14431
C  -5.325419 -0.325536 -0.25743
C  -4.212992 -1.234856 1.723943
C  -5.401162 -0.912347 1.028267
H  0.724202 0.435743 -1.661008
H  -0.537859 -0.034623 0.991625
H  2.417929 -0.584797 1.607245
H  3.586954 0.930268 -0.603604
H  1.181337 -1.74478 -2.390609
H  -0.275191 2.481016 0.627038
H  3.580316 -2.782474 1.888593
H  4.681635 3.03893 0.163373
H  2.376245 -3.933986 -2.126453
H  0.820434 4.584286 1.422252
H  3.571991 -4.463939 0.020982
H  3.307903 4.87699 1.194476
H  -3.983945 0.380661 -1.839343
H  -2.048798 -1.258417 1.685965
H  -6.243165 -0.082736 -0.804096
H  -4.266432 -1.708963 2.710097
H  -6.376413 -1.125907 1.479685
