program: Gaussian 09
title: 000219159
version: EM64L-G09RevD.01
frameworkgroup: C1[X(C14H14O)]
method: RPBEPBE
basis: SDD
operation: Freq
keyword: #pfreq=noraman
keyword: PBEPBE/SDD
title: #p freq=noraman PBEPBE/SDD
converged: YES YES NO NO
title: Mulliken charges:
elementType: O C C C C C C C C C C C C C C H H H H H H H H H H H H H H
charge: -0.288078 -0.285355 0.484364 0.373046 -0.455787 -0.387471 -0.350992 -0.420402 -0.224217 -0.227156 -0.225374 -0.216648 -0.243147 -0.248304 -0.507208 0.201741 0.233664 0.240816 0.255291 0.282304 0.226520 0.223376 0.226697 0.223225 0.228725 0.225599 0.197733 0.225231 0.231807
chargesum: 0.00000
title: Mulliken charges with hydrogens summed into heavy atoms:
elementType: O C C C C C C C C C C C C C C
charge: -0.288078 -0.083614 0.484364 0.373046 -0.222123 -0.146654 -0.095702 -0.138098 0.002303 -0.003779 0.001323 0.006578 -0.014422 -0.022705 0.147563
polarizability: 1.84392608e+02 -9.25863814e+00 1.36167291e+02 -1.51714235e+01 3.43058108e+00 1.16422109e+02
1716.lowfreq: -8.8928 -0.0008 -0.0007 -0.0005 4.5349 8.1094 20.0444 30.5727 64.4137
frequency: 20.0280 30.3129 64.4120 84.2099 138.2823 163.4589 209.4693 227.8537 258.7450 287.2981 356.4846 401.6323 402.8863 411.8085 462.4075 532.2007 605.0075 615.6452 616.7987 647.4320 704.4195 706.0691 740.9576 768.4773 826.7048 856.4174 860.6763 862.9713 900.0808 932.2278 938.3283 978.4500 984.4593 989.9702 990.6261 997.4098 999.9628 1024.4938 1027.6373 1039.0545 1079.2655 1082.9418 1116.8195 1148.5099 1170.3176 1172.1325 1180.9153 1184.9982 1189.3466 1210.6317 1268.3849 1303.4190 1319.5371 1336.6605 1382.7777 1386.5770 1431.6867 1434.9631 1442.6723 1456.0709 1478.7543 1480.9975 1482.3849 1591.7773 1595.0410 1610.7192 1615.0565 2898.8855 2936.2508 3021.7731 3104.7835 3110.8302 3118.6951 3125.2868 3127.2188 3137.0624 3140.5450 3148.4490 3157.7715 3163.5336 3177.5757
redmass: 3.8826 3.7881 4.7282 2.9483 2.6595 2.6778 3.5230 1.6794 3.5117 5.0145 4.6449 2.8374 2.8958 3.9833 3.4045 3.9288 5.0616 6.3200 6.3664 5.0212 2.1249 1.6715 1.7538 2.0281 3.3623 1.2550 1.3263 2.7244 3.9250 1.6372 1.5454 1.3912 1.3894 5.7582 6.1903 1.3232 1.3138 2.4083 2.1526 6.0088 1.5859 1.6077 1.2674 1.4442 1.0606 1.0659 1.5657 1.1356 1.5504 1.8512 1.6894 1.4332 1.3100 1.2698 8.0731 6.9175 1.3213 1.8343 2.0135 1.0543 1.0629 2.2586 2.2907 6.2645 6.1471 6.0677 6.1086 1.0820 1.0357 1.0996 1.0987 1.0878 1.0849 1.0859 1.0883 1.0911 1.0939 1.0959 1.0990 1.1014 1.0953
irintensity: 0.0893 0.0532 0.1953 4.0455 3.3192 2.2496 0.3789 5.2222 3.8090 0.0769 1.4237 0.5041 0.7504 4.4777 3.1440 6.1376 21.9076 2.8554 1.0349 13.6442 40.2166 55.2467 70.4118 46.2640 3.1518 0.0943 1.3562 3.5814 15.8356 4.4710 3.2811 0.0012 0.2139 0.4030 0.5839 0.6924 0.8849 13.4659 24.2966 93.6885 4.4899 13.1481 0.3158 13.5017 0.1553 0.3455 3.5041 4.1822 5.5078 4.7217 10.3035 19.1830 4.5493 1.6286 0.9471 0.3273 6.5353 10.3415 10.8306 8.6993 15.3388 3.2767 23.7197 1.1543 0.1928 3.5614 5.5433 39.3241 79.6059 55.1300 28.5630 8.7598 2.9665 0.0250 4.6869 15.7749 36.6668 33.4579 30.6725 23.8976 7.6664
temp: 298.150 k
press: 1.00000 atm
elementType: 8 6 6 6 6 6 6 6 6 6 6 6 6 6 6 1 1 1 1 1 1 1 1 1 1 1 1 1 1
symmnumber: 1
zpe: 623181.4 jmol-1
zpe.correction: 0.237357 hartree
zpe.thermalcorrener: 0.250572 hartree
zpe.thermalcorrenthalpy: 0.251517 hartree
zpe.thermalcorrgfe: 0.195620 hartree
zpe.sumelectzpe: -616.024904 hartree
zpe.sumelectthermal: -616.011689 hartree
zpe.sumelectthermalent: -616.010744 hartree
zpe.sumelectthermalfe: -616.066641 hartree
dipole: 1.5821 -0.0565 -0.7637
dipole: 1.7577
quadrupole: -80.9381 -83.5269 -85.1721
quadrupole: 0.9533 -3.0928 -1.0002
quadrupole: 2.2743 -0.3145 -1.9597 0.9533 -3.0928 -1.0002
hfenergy: -616.262261 hartree
pointgroup: C01 [X(C14H14O1)]
dipole: -0.5818188 -0.1189856 0.3543435 debye
polarizability: 178.9405|14.9273719|138.7449026|-19.901164|-2.4802339|119.2966057 unknown
InChI: InChI=1S/C14H14O/c1-15-14(12-8-4-2-5-9-12)13-10-6-3-7-11-13/h2-11,14H,1H3
charge 0 multiplicity 1
29 atoms
O  -0.124988 2.22159 0.148096
C  0.002675 0.851906 0.686195
C  -1.213241 -0.00489 0.32728
C  1.327876 0.284645 0.166839
C  -2.065846 -0.508476 1.338008
C  1.634862 -1.083471 0.379949
C  -1.517404 -0.277156 -1.031162
C  2.275058 1.11079 -0.48412
C  -3.202324 -1.282279 1.003799
C  2.87089 -1.616244 -0.046223
C  -2.653303 -1.042336 -1.368786
C  3.509693 0.574453 -0.917732
C  -3.498513 -1.550203 -0.351548
C  3.814713 -0.787976 -0.698217
C  -1.229709 2.972478 0.745564
H  0.057602 0.919085 1.799364
H  -1.840479 -0.295919 2.391322
H  0.900443 -1.734676 0.869181
H  -0.858843 0.116866 -1.813429
H  2.029918 2.163365 -0.647508
H  -3.853218 -1.670585 1.795306
H  3.09545 -2.675218 0.125232
H  -2.880952 -1.247571 -2.42103
H  4.233822 1.222543 -1.424935
H  -4.378351 -2.148173 -0.614869
H  4.773387 -1.200973 -1.032248
H  -1.125044 3.029871 1.850359
H  -2.212932 2.524092 0.500943
H  -1.169544 3.985559 0.317869
