program: Gaussian 09
title: 000219158
version: EM64L-G09RevD.01
frameworkgroup: C1[X(C7H6ClNO)]
method: RPBEPBE
basis: SDD
operation: Freq
keyword: #p
keyword: freq=noraman
keyword: PBEPBE/SDD
title: #p freq=noraman PBEPBE/SDD
converged: NO NO NO NO
title: Mulliken charges:
elementType: Cl O N C C C C C C C H H H H H H
charge: -0.051299 -0.413621 -0.068550 0.447400 -0.373638 -0.350897 -0.205933 -0.201019 -0.100668 -0.314840 0.235527 0.269832 0.257860 0.256983 0.240832 0.372032
chargesum: 0.00000
title: Mulliken charges with hydrogens summed into heavy atoms:
elementType: Cl O N C C C C C C C
charge: -0.051299 -0.041589 -0.068550 0.447400 -0.138111 -0.081065 0.051927 0.055964 -0.100668 -0.074008
polarizability: 1.88242443e+02 5.71162896e+00 8.90454641e+01 7.60058444e-04 5.93978745e-03 3.54907907e+01
1716.lowfreq: -0.0027 0.0016 0.0023 3.1033 7.8043 11.1273 66.3727 117.5569 126.6812
frequency: 66.2892 117.5481 126.5282 194.7841 266.5470 295.4817 359.7811 409.1689 419.2656 421.1315 475.8722 515.0159 624.4283 678.8443 717.1439 826.5572 841.4876 847.6421 915.0140 941.4491 966.6971 979.4706 997.6787 1069.9064 1111.1088 1183.3764 1209.7917 1230.6678 1296.3641 1362.2509 1392.1334 1403.0651 1480.6999 1559.6307 1588.6846 1602.2345 3064.1833 3131.8930 3152.1876 3167.4721 3172.5353 3587.4405
redmass: 6.8987 6.9825 3.5248 9.0063 6.6669 13.0490 4.7669 2.2013 1.3056 4.7745 8.1311 2.7902 7.1479 6.7925 3.5380 1.3253 1.3900 4.4980 8.6955 1.3761 1.4531 1.3618 4.0853 2.7939 1.3665 1.1147 1.6043 1.4197 1.2814 4.6331 1.7377 3.5958 2.6126 7.0156 6.5782 6.1803 1.0898 1.0896 1.0884 1.0958 1.0977 1.0675
irintensity: 0.0008 0.4979 0.7591 0.0254 1.8484 0.9190 0.4509 39.0362 145.1461 2.6150 44.9514 23.8136 0.3168 0.2012 2.1317 25.1972 39.8503 92.7278 164.5779 16.0428 15.0788 1.6811 21.2585 50.8755 11.2335 0.2557 96.1192 1.4662 0.3694 0.4064 10.6934 10.6430 75.7628 0.9553 0.6862 22.9203 14.7344 9.2476 0.7509 5.9054 1.1599 95.2026
temp: 298.150 k
press: 1.00000 atm
elementType: 17 8 7 6 6 6 6 6 6 6 1 1 1 1 1 1
symmnumber: 1
zpe: 297687.4 jmol-1
zpe.correction: 0.113383 hartree
zpe.thermalcorrener: 0.122496 hartree
zpe.thermalcorrenthalpy: 0.123440 hartree
zpe.thermalcorrgfe: 0.078470 hartree
zpe.sumelectzpe: -859.609265 hartree
zpe.sumelectthermal: -859.600153 hartree
zpe.sumelectthermalent: -859.599209 hartree
zpe.sumelectthermalfe: -859.644179 hartree
dipole: -1.4547 0.1776 0.0000
dipole: 1.4655
quadrupole: -64.6486 -55.9619 -68.3961
quadrupole: 4.5941 0.0013 0.0013
quadrupole: -1.6464 7.0403 -5.3939 4.5941 0.0013 0.0013
hfenergy: -859.7226486 hartree
pointgroup: C01 [X(C7H6Cl1N1O1)]
dipole: -0.571006 0.0800186 0.0000053 debye
dipolederiv: -0.9737932 0.0787973 0.0000167 0.1027723 -0.1351437 -0.0000064 0.0000218 -0.0000066 -0.0662171 -1.6992312 -0.1076345 -0.0000274 0.5392485 -0.0066198 0.0001022 0.0001431 0.000105 -0.3929571 0.991075 0.1644167 0.0000363 -0.4939937 -0.1838054 -0.0000088 -0.0001329 -0.0000075 -0.1831749 0.0882754 0.0344298 0.0000042 0.092604 -0.0877909 -0.0000146 0.0000624 -0.000014 0.0211694 0.0414935 -0.0745064 -0.0000106 0.0228255 0.0778028 0.0000218 0.0000003 0.0000227 -0.1678501 0.0181622 0.0491263 -0.0000065 -0.0293247 0.0353421 0.0000061 -0.0000183 0.0000132 -0.1281724 -0.3044092 0.1305346 0.0000125 0.2063615 -0.0336994 0.0000065 0.0000098 0.0000024 -0.1020827 -0.3850873 -0.0630174 -0.0000003 -0.1135098 0.0276062 0.0000059 0.0000004 0.0000075 -0.1015912 1.3132187 -0.1257076 -0.0000317 -0.1250589 0.1577155 0.0000223 -0.0000339 0.0000199 -0.0723886 0.3083302 -0.0729055 -0.0000004 -0.341008 0.1518814 0.0000478 -0.0000859 0.0000374 -0.0491639 0.0346738 0.09124 0.0000111 0.0661713 -0.0539429 -0.0000183 0.0000107 -0.0000198 0.16007 0.0486796 -0.0724008 0.0000012 -0.0449998 0.0204238 -0.0000069 0.0000036 -0.0000091 0.1571438 0.0315352 -0.0760341 -0.0000046 -0.0731209 0.0139618 -0.0000122 -0.0000022 -0.0000126 0.1685786 0.0600019 0.0602955 0.0000052 0.0598593 -0.0165832 -0.0000129 0.0000073 -0.0000105 0.1646873 0.0236811 0.0085752 0.000003 0.0678268 -0.0804183 -0.0000579 0.0000043 -0.0000524 0.1953288 0.4033943 -0.0252091 -0.0000085 0.0633469 0.1132701 -0.0000746 0.0000096 -0.0000754 0.39662 unknown
polarizability: 188.4139836|3.9467714|88.8739238|0.0008654|0.0059254|35.4907907 unknown
InChI: InChI=1S/C7H6ClNO/c8-7-3-1-6(2-4-7)5-9-10/h1-5,10H
charge 0 multiplicity 1
16 atoms
Cl 4.04748 -0.319693 -0.000012
O  -4.225617 -0.044269 0.00002
N  -2.855284 -0.543335 -0.000094
C  -0.562536 0.245527 0.000109
C  0.306083 1.372192 0.000193
C  0.0077 -1.061326 0.0000
C  1.707262 1.210082 0.000154
C  1.403302 -1.23564 -0.000038
C  2.236818 -0.09505 0.000036
C  -2.012802 0.470062 0.000141
H  -0.114284 2.385056 0.000284
H  -0.65599 -1.93155 -0.000049
H  2.372427 2.078822 0.000216
H  1.841697 -2.238445 -0.000112
H  -2.384735 1.507864 0.000359
H  -4.765522 -0.874298 -0.000206
