program: Gaussian 09
title: 000219150
version: EM64L-G09RevD.01
frameworkgroup: C1[X(C14H10N2O)]
method: RPBEPBE
basis: SDD
operation: Freq
keyword: #p
keyword: freq=noraman
keyword: PBEPBE/SDD
title: #p freq=noraman PBEPBE/SDD
converged: NO YES NO NO
title: Mulliken charges:
elementType: O N N C C C C C C C C C C C C C C H H H H H H H H H H
charge: -0.271727 0.048948 -0.437638 0.230699 -0.127617 0.157069 0.344285 -0.348379 -0.370312 0.116716 -0.235454 -0.373780 -0.373899 -0.223281 -0.223059 -0.222925 -0.236267 0.259406 0.278833 0.234874 0.246085 0.246084 0.238612 0.349358 0.230770 0.230739 0.231862
chargesum: 0.00000
title: Mulliken charges with hydrogens summed into heavy atoms:
elementType: O N N C C C C C C C C C C C C C C
charge: -0.271727 0.048948 -0.088281 0.230699 -0.127617 0.157069 0.344285 -0.088973 -0.091480 0.116716 -0.000580 -0.127695 -0.127815 0.015331 0.007712 0.007813 -0.004405
polarizability: 2.26019766e+02 8.27897433e+00 1.62619439e+02 -9.21813696e-02 9.99448591e-02 1.05396488e+02
1716.lowfreq: -49.0421 -5.6128 -0.0005 -0.0002 -0.0001 9.5566 12.2216 56.6536 68.5293
frequency: -49.0151 56.4311 68.4911 122.4006 154.8131 212.3502 223.9114 274.1914 299.5926 397.2670 404.0070 433.4163 455.9616 468.1351 471.3336 526.1506 577.0727 597.0390 610.1330 656.0009 667.6800 689.0605 704.1939 725.2215 763.7085 773.3426 782.4204 793.6723 800.2176 854.6156 906.1161 922.2694 960.4685 976.8310 986.0316 988.9651 997.8878 1011.2690 1022.0710 1028.9981 1068.6085 1078.0383 1089.9186 1129.0993 1173.3824 1175.6508 1187.9565 1211.7497 1256.6095 1284.8959 1311.3366 1343.6203 1370.3925 1392.2331 1399.1530 1428.3798 1445.8441 1466.3208 1487.3512 1518.5041 1570.9536 1585.3954 1613.4502 1615.1157 1629.9514 3125.7822 3131.3811 3134.9817 3142.3232 3148.4091 3152.2763 3160.4226 3166.7345 3171.4482 3531.5326
redmass: 3.9786 5.9957 5.2274 5.5183 4.3962 5.7877 5.1162 6.1712 7.0449 2.8160 4.9474 4.2787 4.9819 4.3105 8.3233 6.7046 5.1947 5.9009 6.1634 2.4988 5.0215 6.0794 1.6817 7.3806 1.3583 2.0047 5.9646 1.4919 4.2156 1.2456 1.4932 1.4763 6.0509 1.3890 1.3794 6.2171 1.3222 1.3423 2.9413 2.1741 3.2475 1.6065 3.9027 1.9818 1.0534 1.0839 1.1146 2.8046 3.0174 1.9972 1.3586 3.5103 7.2824 2.0465 5.6331 2.1789 2.1878 2.6114 2.7420 4.8263 6.7176 6.0200 6.2185 6.3323 6.2159 1.0847 1.0880 1.0860 1.0927 1.0897 1.0969 1.0951 1.1018 1.1004 1.0786
irintensity: 0.0013 0.4618 0.3780 3.1126 1.0323 0.0181 0.1071 1.8842 5.4839 0.0715 0.0013 6.6655 9.3744 0.0997 1.5403 12.3849 5.9627 9.6606 0.0155 1.2842 0.2682 0.1424 47.7984 11.4868 141.6699 59.6609 8.3533 46.0715 3.4851 0.0602 0.5104 6.1482 11.0680 0.0035 1.5866 3.4185 0.0623 0.5770 7.9047 14.2915 6.4565 9.0657 17.8729 40.7488 0.0084 3.7304 1.7700 23.6473 39.6477 20.1735 0.4444 10.2603 0.0593 2.0771 43.0515 8.6880 16.8329 18.5660 6.8160 3.9918 31.7525 1.2751 1.2592 29.5908 328.3419 1.4048 0.0826 2.3433 17.1345 7.1932 33.1566 6.2817 22.2731 20.6663 58.5947
temp: 298.150 k
press: 1.00000 atm
elementType: 8 7 7 6 6 6 6 6 6 6 6 6 6 6 6 6 6 1 1 1 1 1 1 1 1 1 1
symmnumber: 1
zpe: 538696.0 jmol-1
zpe.correction: 0.205178 hartree
zpe.thermalcorrener: 0.217001 hartree
zpe.thermalcorrenthalpy: 0.217946 hartree
zpe.thermalcorrgfe: 0.166706 hartree
zpe.sumelectzpe: -723.068235 hartree
zpe.sumelectthermal: -723.056412 hartree
zpe.sumelectthermalent: -723.055468 hartree
zpe.sumelectthermalfe: -723.106707 hartree
dipole: 2.9961 3.2840 -0.0066
dipole: 4.4454
quadrupole: -100.4347 -92.9185 -94.0266
quadrupole: -6.4635 0.0061 0.0424
quadrupole: -4.6415 2.8748 1.7667 -6.4635 0.0061 0.0424
hfenergy: -723.2734133 hartree
pointgroup: C01 [X(C14H10N2O1)]
dipole: -1.1384665 -1.3275887 0.015514 debye
polarizability: 225.4504998|10.2106761|163.177403|-0.2423871|-0.8148136|105.40779 unknown
InChI: InChI=1S/C14H10N2O/c17-14-12-9-5-4-8-11(12)13(15-16-14)10-6-2-1-3-7-10/h1-9,16H
charge 0 multiplicity 1
27 atoms
O  3.710076 1.937165 -0.029054
N  0.068663 1.971225 -0.025778
N  1.411057 2.306322 -0.031555
C  0.800933 -0.373705 -0.001046
C  -0.229163 0.666786 -0.010945
C  2.180991 0.018803 -0.006936
C  -1.68921 0.317904 -0.00374
C  0.486042 -1.764378 0.014267
C  3.208514 -0.956815 0.002669
C  2.53754 1.45343 -0.023633
C  1.513047 -2.723171 0.023439
C  -2.38039 0.150056 1.222742
C  -2.389639 0.133473 -1.222558
C  2.878018 -2.322702 0.017783
C  -3.752233 -0.189549 1.230605
C  -3.761488 -0.206265 -1.215245
C  -4.445885 -0.37001 0.011457
H  -0.563371 -2.075909 0.018817
H  4.247652 -0.611926 -0.002229
H  1.260872 -3.789206 0.03515
H  -1.845272 0.296158 2.16788
H  -1.861794 0.266701 -2.173659
H  3.669069 -3.079975 0.025159
H  1.592391 3.313821 -0.042657
H  -4.277519 -0.309224 2.184609
H  -4.294004 -0.339059 -2.16349
H  -5.509798 -0.63225 0.017245
