program: Gaussian 09
title: 000219142
version: EM64L-G09RevD.01
frameworkgroup: C1[X(C8H12N2)]
method: RPBEPBE
basis: SDD
operation: Freq
keyword: #pfreq=noraman
keyword: PBEPBE/SDD
title: #p freq=noraman PBEPBE/SDD
converged: YES YES NO NO
title: Mulliken charges:
elementType: N N C C C C C C C C H H H H H H H H H H H H
charge: -0.049724 -0.684573 0.400093 -0.553683 0.325456 -0.458784 -0.560656 0.173973 -0.678252 -0.781471 0.225247 0.193688 0.220517 0.240041 0.213745 0.217665 0.233447 0.253118 0.222209 0.221965 0.306691 0.319287
chargesum: 0.00000
title: Mulliken charges with hydrogens summed into heavy atoms:
elementType: N N C C C C C C C C
charge: -0.049724 -0.058595 0.400093 -0.134747 0.325456 -0.238267 -0.320615 0.173973 -0.013396 -0.084180
polarizability: 1.33315396e+02 1.99174358e+00 1.05702333e+02 -4.93066730e+00 2.31195055e+00 6.00509074e+01
1716.lowfreq: -30.9906 -12.7221 -0.0006 -0.0005 0.0002 6.0977 6.8413 81.1214 101.7296
frequency: -30.7774 81.0916 101.6952 188.1581 199.7369 212.3755 288.9353 312.7666 357.7887 378.5544 421.6589 430.5192 464.0581 517.9637 549.8288 628.3391 710.4762 752.6308 756.0317 789.1857 861.3934 922.4245 922.7148 960.0454 986.0198 1047.3463 1047.9178 1052.9667 1062.4889 1165.8032 1215.9951 1240.3155 1278.7592 1305.4399 1323.1084 1347.0528 1385.0706 1390.3530 1419.5868 1458.8191 1471.8298 1472.4264 1476.9024 1488.7404 1492.5336 1562.9587 1599.5218 1640.4387 2955.5013 2979.9280 2981.1477 3027.7807 3057.5785 3075.4363 3085.5240 3101.2330 3113.6724 3120.4674 3565.9683 3706.1552
redmass: 1.0351 2.8356 2.8655 1.3403 2.6835 2.8728 2.5408 2.1368 1.2057 2.5198 1.5177 2.2116 2.4708 3.5349 5.9018 5.3830 3.5869 3.3259 3.6858 1.3237 1.4569 1.6412 2.3379 2.3573 1.5877 1.5162 1.5603 1.5266 1.8869 2.7753 1.8945 1.3725 2.9334 1.4418 1.8201 2.8952 1.2430 1.2086 4.1111 1.2571 1.0468 1.0474 1.1797 1.8171 1.1955 5.8968 5.2531 1.2249 1.0663 1.0379 1.0356 1.0943 1.0975 1.0999 1.1003 1.0909 1.0978 1.0919 1.0450 1.1035
irintensity: 0.1899 0.2065 0.5592 1.4828 3.0670 0.0461 4.3872 3.4946 233.9941 13.3808 25.7332 15.1841 0.5440 0.4955 0.5158 0.6031 1.5418 0.7432 0.8103 4.3324 31.8544 7.0237 16.1458 8.5844 5.4671 2.3144 7.4703 20.2957 4.3009 6.0091 4.6898 0.0794 23.3308 7.6800 3.4266 17.4879 21.4536 10.4040 13.9383 21.8574 15.1572 11.8473 9.6629 33.5273 31.3034 51.0556 122.0714 211.3365 47.8338 39.1411 31.3593 10.5001 24.5982 52.1077 32.2374 39.0855 8.5392 18.1296 47.4357 21.5294
temp: 298.150 k
press: 1.00000 atm
elementType: 7 7 6 6 6 6 6 6 6 6 1 1 1 1 1 1 1 1 1 1 1 1
symmnumber: 1
zpe: 487545.0 jmol-1
zpe.correction: 0.185696 hartree
zpe.thermalcorrener: 0.195499 hartree
zpe.thermalcorrenthalpy: 0.196443 hartree
zpe.thermalcorrgfe: 0.151123 hartree
zpe.sumelectzpe: -420.808002 hartree
zpe.sumelectthermal: -420.798199 hartree
zpe.sumelectthermalent: -420.797254 hartree
zpe.sumelectthermalfe: -420.842575 hartree
dipole: 2.7163 3.6293 -0.0779
dipole: 4.5339
quadrupole: -55.4863 -55.2817 -64.0218
quadrupole: -3.4886 -1.9824 -0.0685
quadrupole: 2.7770 2.9816 -5.7585 -3.4886 -1.9824 -0.0685
hfenergy: -420.9936978 hartree
pointgroup: C01 [X(C8H12N2)]
dipole: -1.0702592 1.4244567 -0.0856044 debye
dipolederiv: -0.7967102 -0.0014664 0.0460383 -0.1636418 -0.5146191 0.050116 0.099936 0.0423903 -0.2556736 -0.5899309 0.5556363 -0.082251 0.5765998 -0.9467008 -0.0447911 -0.131645 -0.0378659 -0.6789995 0.056933 0.0243278 0.0019593 0.2941788 -0.4473851 0.0256927 -0.0641671 0.0550002 -0.1195955 0.076205 0.0138774 -0.0306891 0.0427178 0.1461675 0.0282329 -0.1047351 0.0010806 0.1335901 0.5691036 -0.5933978 0.013074 -0.6472105 0.990925 -0.0289891 0.0411737 -0.0302699 0.1382079 -0.5183255 0.3603061 -0.0096539 0.13862 -0.1311925 -0.0294678 0.0248631 -0.0639696 -0.2115924 0.4057815 -0.0818672 -0.0541844 -0.0258449 0.3522335 -0.0726005 -0.0570834 -0.0542177 -0.0831613 0.7233671 -0.0153553 -0.0890231 0.1004302 0.3771973 -0.0512318 -0.1122518 -0.054683 0.0233078 -0.0157751 -0.0138035 -0.0401648 -0.0137466 0.0636096 -0.01317 0.0234303 0.0173402 -0.0163775 -0.2495677 -0.0218202 0.0424026 -0.0935628 0.0399354 0.0137369 0.0542539 0.0089632 0.0621343 0.0440265 0.0058547 -0.0163185 -0.0846344 -0.098399 0.1243825 0.0048719 0.0728325 0.014779 -0.0516875 0.0268854 0.0439774 0.0947305 -0.038714 -0.1541587 0.0500396 -0.0869653 -0.0463179 0.0460621 -0.0581645 0.0197358 -0.0900533 -0.1132752 0.0476015 0.0286287 0.0463741 0.1574295 0.0209094 -0.1066861 0.0337983 -0.1108145 -0.0775426 0.0411375 0.032065 0.0421494 0.1083788 0.1088511 -0.0452064 0.0192173 0.0026262 -0.0991189 0.1251728 0.0149694 0.0699495 0.0149845 -0.2579177 -0.0501251 0.0023843 -0.0372315 0.0995361 0.003654 0.0071217 -0.0007606 0.0628967 0.0815947 0.0836327 0.0464712 0.029745 -0.0321118 -0.1182477 0.0102768 -0.0789359 -0.0143752 0.0649874 0.0356372 0.0008125 0.1400626 -0.0561461 0.0090794 -0.0146931 0.0211291 0.1138606 0.0142835 -0.0032135 0.025935 -0.0267751 0.0730066 0.095529 0.0994072 0.0778752 -0.0975609 -0.0208878 -0.0372034 -0.0368515 -0.085125 0.0123707 -0.1114085 -0.0959998 -0.1019778 -0.0046204 0.1346788 -0.0450438 0.0305948 -0.0390198 0.1896354 0.0256014 0.0391039 0.0190709 0.360259 0.1540184 -0.0328045 0.0327354 -0.0020507 0.210588 0.034129 0.0504341 0.0354905 0.3384461 unknown
polarizability: 133.4024478|-2.2572907|105.0965077|-4.1067071|-5.7114252|60.5696813 unknown
InChI: InChI=1S/C8H12N2/c1-3-7-5-10-6(2)4-8(7)9/h4-5H,3,9H2,1-2H3
charge 0 multiplicity 1
22 atoms
N  1.397081 -1.331015 0.177149
N  -1.114186 2.098181 0.000608
C  -0.861658 -0.332536 0.308329
C  -2.354139 -0.551788 0.490015
C  -0.306144 0.96529 0.055385
C  1.099726 1.068641 -0.132791
C  0.04454 -1.412329 0.359785
C  1.914608 -0.084412 -0.071583
C  -3.147846 -0.521372 -0.846535
C  3.414831 0.002974 -0.277695
H  -2.515158 -1.533493 0.973926
H  -2.776767 0.199747 1.190628
H  1.558354 2.046143 -0.326741
H  -0.341025 -2.42072 0.563077
H  -3.004054 0.430926 -1.38937
H  -4.230548 -0.65614 -0.667583
H  -2.80545 -1.332391 -1.513111
H  3.851472 -1.003272 -0.18262
H  3.662772 0.403935 -1.278543
H  3.888056 0.666986 0.469992
H  -0.704494 3.015434 -0.151432
H  -2.115868 2.038113 0.153512
