program: Gaussian 09
title: 000219138
version: EM64L-G09RevD.01
frameworkgroup: C1[X(C16H19N)]
method: RPBEPBE
basis: SDD
operation: Freq
keyword: #pfreq=noraman
keyword: PBEPBE/SDD
title: #p freq=noraman PBEPBE/SDD
converged: YES YES NO NO
title: Mulliken charges:
elementType: N C C C C C C C C C C C C C C C C H H H H H H H H H H H H H H H H H H H
charge: -0.133847 -0.292773 0.299636 0.470149 0.278459 -0.377606 -0.631729 -0.641898 -0.458025 -0.360024 -0.414948 -0.858868 -0.267969 -0.242137 -0.232821 -0.234693 -0.244420 0.189702 0.282847 0.256246 0.185347 0.217305 0.222395 0.186501 0.257314 0.233498 0.254316 0.225666 0.257558 0.223496 0.226902 0.224740 0.224050 0.224697 0.224047 0.226889
chargesum: 0.00000
title: Mulliken charges with hydrogens summed into heavy atoms:
elementType: N C C C C C C C C C C C C C C C C
charge: -0.133847 -0.103072 0.299636 0.470149 0.278459 -0.094759 0.027169 0.024311 -0.224527 -0.105708 -0.189281 -0.150913 -0.043229 -0.018087 -0.008125 -0.010646 -0.017531
polarizability: 2.01093622e+02 -3.15555785e+00 1.51237173e+02 1.32464416e+01 -4.47003298e+00 1.65212838e+02
1716.lowfreq: -15.8484 -6.6174 -0.0004 0.0006 0.0007 6.1618 33.6446 55.1678 63.4819
frequency: 33.5391 55.0936 63.4673 88.4422 105.2243 136.2277 163.9660 190.7049 224.4459 236.1962 241.8496 250.7364 286.8265 307.3098 331.7570 356.3666 404.3586 413.3880 454.0308 472.3258 504.0594 526.0770 551.7150 608.8958 619.2854 640.4672 704.4126 736.3062 757.2354 761.9569 789.4989 820.7122 852.6023 854.4245 858.3176 889.5736 927.6214 968.5346 975.6124 987.2876 990.8593 994.3037 1007.1015 1011.9412 1027.2850 1032.9172 1043.3610 1046.3257 1080.6318 1089.7711 1101.8237 1136.3519 1170.7217 1171.1640 1175.7120 1185.1071 1187.3230 1191.4824 1226.4844 1243.5743 1272.1670 1286.4954 1320.5268 1340.3344 1377.3586 1385.4064 1400.8072 1417.9903 1431.3535 1438.9758 1444.1339 1463.1540 1470.9739 1471.5453 1473.8993 1477.0786 1480.1682 1483.2676 1487.1456 1585.2813 1592.7665 1608.7813 1612.4825 2834.8582 2853.5051 2866.8010 2969.6049 3031.8480 3034.1430 3045.3109 3079.6999 3097.1283 3102.9928 3110.3742 3114.4758 3123.7749 3124.4790 3136.9786 3137.9867 3150.9572 3156.1686 3163.4780
redmass: 3.6540 4.1915 4.1063 2.6916 3.6551 3.0197 1.3579 1.9526 2.2556 1.1850 1.4855 3.1210 3.5190 3.0027 2.9678 3.1421 2.8064 2.6451 3.0243 2.8334 3.3853 4.7081 3.5889 5.7238 5.9782 5.2432 1.7221 3.6591 2.3206 1.2712 3.5168 4.3281 1.6279 2.2637 3.3075 1.3131 1.5277 1.3585 1.3945 1.5939 5.8309 1.3292 2.3221 1.4309 2.1211 1.5557 1.9220 1.6550 1.6104 1.3083 1.9082 1.4313 1.0672 1.0666 1.9704 3.0247 1.1481 2.1268 2.6974 2.2909 1.9136 1.4943 1.4703 1.3043 4.0575 5.8701 1.2703 1.1435 2.0677 1.7113 1.3561 1.0473 1.0584 1.0583 2.0787 1.0875 2.0676 1.2388 1.0657 6.4571 6.0339 6.1105 6.2108 1.0798 1.0574 1.0575 1.0377 1.0742 1.0735 1.0967 1.0982 1.0992 1.0986 1.0873 1.0855 1.0884 1.0862 1.0920 1.0935 1.0949 1.1006 1.1007
irintensity: 0.2459 0.1219 0.1451 0.9715 0.2701 0.5997 0.8608 0.0600 1.1655 0.5228 0.9016 1.0285 2.1416 1.4037 2.2093 3.9833 0.3080 2.4292 4.6860 0.8898 3.8590 0.8510 7.9520 4.0659 4.5120 7.1096 52.5164 8.1256 34.9106 68.2909 8.6619 5.3245 2.9956 7.6042 4.3534 0.9627 7.9268 1.6505 0.1562 1.8627 0.1717 2.1833 48.6565 3.9508 3.5346 17.3234 11.6744 13.2841 10.6045 2.9711 6.1686 6.6257 1.5209 0.4649 4.2306 6.6419 2.1241 3.3959 3.6179 3.7958 10.2812 4.4246 10.8439 2.2528 2.8707 0.7465 12.5362 1.0628 1.6136 10.8622 11.2602 16.6398 5.7721 8.2133 32.4939 8.5218 16.1962 23.6544 12.6568 0.6985 1.0186 5.4788 1.8634 36.4860 55.6323 201.0067 27.5239 12.7666 66.5318 17.4458 27.7365 25.2603 27.6442 8.8624 5.2922 10.6093 0.3986 25.3539 19.8032 29.7324 39.8712 20.2702
temp: 298.150 k
press: 1.00000 atm
elementType: 7 6 6 6 6 6 6 6 6 6 6 6 6 6 6 6 6 1 1 1 1 1 1 1 1 1 1 1 1 1 1 1 1 1 1 1
symmnumber: 1
zpe: 799833.7 jmol-1
zpe.correction: 0.304641 hartree
zpe.thermalcorrener: 0.320707 hartree
zpe.thermalcorrenthalpy: 0.321651 hartree
zpe.thermalcorrgfe: 0.261203 hartree
zpe.sumelectzpe: -674.596255 hartree
zpe.sumelectthermal: -674.580189 hartree
zpe.sumelectthermalent: -674.579244 hartree
zpe.sumelectthermalfe: -674.639693 hartree
dipole: 0.5775 0.2710 0.9923
dipole: 1.1797
quadrupole: -97.9933 -99.7245 -95.3292
quadrupole: -0.4715 1.4686 -0.1049
quadrupole: -0.3110 -2.0421 2.3531 -0.4715 1.4686 -0.1049
hfenergy: -674.9008952 hartree
pointgroup: C01 [X(C16H19N1)]
dipole: 0.1504224 0.2072704 0.3870581 debye
polarizability: 195.0127274|2.4597768|150.0815922|18.8657392|0.3714488|172.4493127 unknown
InChI: InChI=1S/C16H19N/c1-13-9-7-8-12-15(13)16(17(2)3)14-10-5-4-6-11-14/h4-12,16H,1-3H3
charge 0 multiplicity 1
36 atoms
N  0.115126 2.20507 -0.55984
C  -0.060911 1.007146 0.325372
C  -1.263818 0.156785 -0.124939
C  1.21076 0.142739 0.369028
C  -1.983547 -0.646712 0.810768
C  -1.626624 0.122697 -1.494638
C  1.393854 2.919016 -0.34257
C  -1.025791 3.142398 -0.426903
C  1.954752 0.027553 1.568684
C  1.660798 -0.553237 -0.78212
C  -3.049597 -1.452841 0.335257
C  -1.633654 -0.673561 2.29033
C  -2.689201 -0.684711 -1.952111
C  -3.406741 -1.479995 -1.030968
C  3.125789 -0.76336 1.623247
C  2.833888 -1.336558 -0.734515
C  3.570342 -1.447544 0.469579
H  -0.248359 1.352787 1.375344
H  -1.065948 0.762187 -2.186038
H  2.2469 2.251432 -0.539418
H  1.501418 3.324957 0.695381
H  1.449631 3.768468 -1.046556
H  -0.904635 3.969724 -1.148419
H  -1.102994 3.584517 0.599009
H  -1.973369 2.626133 -0.649298
H  1.620464 0.568771 2.46316
H  1.08801 -0.478703 -1.71221
H  -3.605443 -2.070426 1.051654
H  -0.600325 -1.032437 2.455053
H  -1.705393 0.330058 2.752509
H  -2.315326 -1.344229 2.840856
H  -2.95437 -0.692774 -3.015516
H  -4.235366 -2.112498 -1.369506
H  3.688762 -0.842463 2.560287
H  3.171992 -1.866439 -1.632483
H  4.477627 -2.06115 0.507034
