program: Gaussian 09
title: 000219137
version: EM64L-G09RevD.01
frameworkgroup: C1[X(C15H16O2)]
method: RPBEPBE
basis: SDD
operation: Freq
keyword: #pfreq=noraman
keyword: PBEPBE/SDD
title: #p freq=noraman PBEPBE/SDD
converged: YES YES NO NO
title: Mulliken charges:
elementType: O O C C C C C C C C C C C C C C C H H H H H H H H H H H H H H H H
charge: -0.267893 -0.267892 -0.708393 0.506247 0.506249 -0.434209 -0.434210 -0.380706 -0.380707 -0.352228 -0.352228 -0.355014 -0.355013 0.310404 0.310403 -0.538351 -0.538351 0.223152 0.223152 0.232496 0.232496 0.241615 0.241616 0.247772 0.247772 0.238038 0.238038 0.219307 0.219902 0.243664 0.219901 0.243664 0.219308
chargesum: 0.00000
title: Mulliken charges with hydrogens summed into heavy atoms:
elementType: O O C C C C C C C C C C C C C C C
charge: -0.267893 -0.267892 -0.262090 0.506247 0.506249 -0.201713 -0.201714 -0.139091 -0.139090 -0.104456 -0.104456 -0.116976 -0.116976 0.310404 0.310403 0.144522 0.144522
polarizability: 2.34215523e+02 9.03886239e-04 1.51573452e+02 -1.63540304e+01 -2.96628959e-04 1.24767322e+02
1716.lowfreq: -17.2881 -6.7447 -6.6684 -0.0007 -0.0005 -0.0003 17.1801 23.3388 33.6304
frequency: 16.6624 23.1455 33.6009 80.2141 92.8570 138.5988 144.9303 206.8308 207.5633 235.8834 239.0985 263.3078 318.2353 330.0136 341.3219 410.8870 413.1694 415.3294 465.9687 496.6591 508.8797 520.9017 559.7153 627.7337 632.8453 694.7608 713.9890 727.0804 752.3392 799.7189 808.9124 819.7468 825.7321 829.2630 846.0751 918.9603 944.8306 959.0026 963.6821 967.5330 989.3836 989.7218 1002.8391 1003.3188 1105.8541 1111.1233 1111.7508 1111.7606 1155.6455 1156.1072 1173.9830 1176.4794 1187.2505 1199.7913 1216.3581 1227.2304 1232.2587 1284.9241 1306.2775 1316.8631 1380.8962 1381.7201 1415.8206 1416.8583 1435.6167 1435.6513 1461.8936 1466.3893 1466.4037 1473.4721 1473.8292 1500.7270 1502.4683 1581.1574 1586.9347 1622.7348 1623.8132 2956.2921 2956.4557 2962.9702 3006.4540 3042.6533 3042.6778 3119.8572 3119.9461 3121.6706 3121.7436 3127.1413 3127.3356 3156.7002 3156.7109 3164.5322 3164.6662
redmass: 3.9904 3.7373 4.1620 3.2730 3.5835 4.3290 4.3529 2.6280 3.0144 1.1806 1.3994 3.4630 3.3378 4.6919 2.5863 5.0176 2.9344 2.9504 3.9225 3.4245 2.6693 3.9265 3.6850 6.7082 6.6537 3.6171 3.0958 4.7417 3.9862 3.3735 1.4376 1.3248 1.3684 4.5945 1.9273 1.4868 1.3724 1.4341 1.3553 1.6032 8.6576 8.6701 2.7317 2.6273 1.3698 1.3332 1.2609 1.2624 1.3694 1.3417 1.2634 1.2392 1.4077 1.8520 1.8370 3.4705 3.7608 1.6151 1.3028 1.5670 5.3751 4.0409 3.2102 3.1525 1.1708 1.1734 1.1105 1.0503 1.0503 1.0765 1.0707 2.4523 2.3899 7.1683 7.0477 6.3328 6.4161 1.0330 1.0331 1.0597 1.1001 1.1038 1.1038 1.0895 1.0895 1.0987 1.0988 1.0890 1.0887 1.0945 1.0944 1.0951 1.0951
irintensity: 1.4117 0.5428 0.4723 5.9840 3.5743 2.6245 1.4842 5.1097 0.7967 0.4275 0.0291 0.7864 0.9152 1.6189 7.9764 1.9007 1.0945 0.0034 2.1100 1.6856 16.9613 31.9849 17.4732 0.8339 2.4662 0.7938 0.5888 21.1605 2.3874 22.0647 60.6817 0.6869 36.9022 1.6365 31.5555 7.0072 0.1479 1.4352 0.0372 2.1270 44.9236 36.1677 3.9901 15.2013 11.3981 23.8095 0.1576 1.0757 0.1259 0.6089 111.9954 26.8097 1.5874 1.8874 69.5317 117.6355 151.3371 8.5354 0.5056 3.2319 15.7363 6.5189 0.0275 1.3042 23.2060 0.2466 18.2090 14.2975 11.9692 87.7318 30.2753 199.7020 50.1597 13.3652 0.1270 44.1152 30.2957 57.9376 80.5838 31.3916 13.9843 62.2552 40.3580 19.4097 12.8063 63.1763 5.5600 15.4595 1.1992 15.1053 14.2585 13.6869 0.8694
temp: 298.150 k
press: 1.00000 atm
elementType: 8 8 6 6 6 6 6 6 6 6 6 6 6 6 6 6 6 1 1 1 1 1 1 1 1 1 1 1 1 1 1 1 1
symmnumber: 1
zpe: 705372.6 jmol-1
zpe.correction: 0.268662 hartree
zpe.thermalcorrener: 0.284600 hartree
zpe.thermalcorrenthalpy: 0.285544 hartree
zpe.thermalcorrgfe: 0.222882 hartree
zpe.sumelectzpe: -730.383404 hartree
zpe.sumelectthermal: -730.367467 hartree
zpe.sumelectthermalent: -730.366523 hartree
zpe.sumelectthermalfe: -730.429184 hartree
dipole: -0.0002 -2.1590 -0.0003
dipole: 2.1590
quadrupole: -98.7659 -89.0633 -97.2184
quadrupole: -0.0010 9.3276 0.0003
quadrupole: -3.7500 5.9526 -2.2025 -0.0010 9.3276 0.0003
hfenergy: -730.6520667 hartree
pointgroup: C01 [X(C15H16O2)]
dipole: -0.0003068 -0.8494044 -0.0003153 debye
polarizability: 232.4555893|-0.0156435|151.5734528|-21.3770473|0.0115264|126.5272552 unknown
InChI: InChI=1S/C15H16O2/c1-16-14-7-3-12(4-8-14)11-13-5-9-15(17-2)10-6-13/h3-10H,11H2,1-2H3
charge 0 multiplicity 1
33 atoms
O  -4.984908 -0.870437 0.484394
O  4.983695 -0.872818 -0.484644
C  0.000147 2.0194 0.000523
C  -1.288718 1.207584 0.125528
C  1.288578 1.206954 -0.124868
C  -2.270329 1.551377 1.092026
C  2.27041 1.55073 -1.091146
C  -1.565489 0.12265 -0.741133
C  1.564734 0.121414 0.741231
C  -3.485831 0.847211 1.188308
C  3.485541 0.845966 -1.187749
C  -2.778101 -0.598592 -0.661931
C  2.776966 -0.600428 0.661704
C  -3.744452 -0.231481 0.307981
C  3.743556 -0.23332 -0.307973
C  -5.29749 -1.99092 -0.403581
C  5.295542 -1.994091 0.402592
H  -0.07395 2.689854 -0.879837
H  0.074609 2.689386 0.881209
H  -2.080877 2.384867 1.77999
H  2.081428 2.384677 -1.778685
H  -0.817057 -0.169715 -1.487177
H  0.816112 -0.170947 1.487085
H  -4.24321 1.110937 1.932854
H  4.243088 1.109682 -1.932128
H  -2.956006 -1.431081 -1.349684
H  2.954406 -1.433366 1.349033
H  -4.569212 -2.817149 -0.283969
H  -5.322491 -1.67169 -1.464117
H  -6.29722 -2.331897 -0.096297
H  5.320727 -1.675583 1.463341
H  6.295063 -2.335498 0.095104
H  4.566739 -2.819773 0.282414
