program: Gaussian 09
title: 000219134
version: EM64L-G09RevD.01
frameworkgroup: C1[X(C11H10ClN)]
method: RPBEPBE
basis: SDD
operation: Freq
keyword: #p
keyword: freq=noraman
keyword: PBEPBE/SDD
title: #p freq=noraman PBEPBE/SDD
converged: NO NO NO NO
title: Mulliken charges:
elementType: Cl N C C C C C C C C C C C H H H H H H H H H H
charge: -0.038890 -0.014988 0.349259 0.367232 -0.070172 -0.379780 0.510752 -0.431979 -0.322944 -0.810772 -0.226448 -0.543401 -0.803947 0.229998 0.267949 0.222336 0.243807 0.243800 0.251770 0.233649 0.223678 0.249545 0.249545
chargesum: 0.00000
title: Mulliken charges with hydrogens summed into heavy atoms:
elementType: Cl N C C C C C C C C C C C
charge: -0.038890 -0.014988 0.349259 0.367232 -0.070172 -0.379780 0.510752 -0.201981 -0.054994 -0.100828 0.007201 -0.291631 -0.081179
polarizability: 1.93519029e+02 4.75441641e+00 1.56804950e+02 -1.55179294e-03 -3.89670806e-04 6.13912862e+01
1716.lowfreq: -0.0016 -0.0013 0.0017 12.9508 14.0368 16.8452 51.5799 101.5103 158.3738
frequency: 51.5025 101.5051 158.3506 203.4242 228.8324 229.3967 264.1677 265.5734 302.5868 315.9222 416.2474 434.4389 474.5723 506.9913 509.0989 526.2865 544.5469 600.1205 653.9381 716.9868 738.3567 776.9758 818.5292 887.1960 909.5351 912.5735 923.4209 990.9202 991.1935 1020.9994 1046.1293 1047.3557 1059.1842 1096.7461 1162.0893 1211.8481 1240.3735 1267.7968 1312.0630 1332.8583 1346.3257 1402.5336 1405.1704 1412.9660 1429.1239 1460.3298 1461.7764 1467.7497 1480.4200 1486.4851 1562.7833 1573.4448 1606.8406 2980.8839 2989.3829 3062.4668 3079.4450 3084.2545 3087.7826 3114.8815 3124.9685 3148.6090 3176.7342
redmass: 4.5955 3.8542 1.0376 3.0605 12.1626 5.0477 1.0505 3.1665 3.7640 4.8189 4.9263 4.6182 3.6958 4.8869 3.4548 5.7665 4.7667 5.0389 3.4083 7.0783 6.8162 1.7824 2.4411 4.9305 4.2976 1.3469 1.3948 1.3427 1.9731 1.5083 1.5438 1.5313 3.4567 1.6871 1.3659 3.3041 3.3932 1.7606 2.9441 3.9153 3.5275 1.4055 1.2231 1.8534 2.9031 2.1003 1.0449 1.0469 1.0951 1.5028 7.1025 7.8900 5.9399 1.0365 1.0363 1.0975 1.0974 1.1001 1.0999 1.0915 1.0881 1.0919 1.0980
irintensity: 0.5996 3.0826 0.3550 1.0868 1.4256 2.6285 0.2737 2.2702 1.4352 1.3942 2.1140 0.4284 0.8426 4.6339 0.7320 2.1020 5.1382 0.0000 5.1198 14.7650 16.1139 39.5405 23.9155 24.9688 3.7743 3.7511 7.8958 0.6649 0.2604 7.5357 2.0129 13.1146 8.0922 14.6414 9.8066 18.2417 6.6948 2.0929 9.8427 31.3565 2.6844 18.6384 15.6242 0.6472 11.2495 6.7798 14.7484 15.4656 15.5745 64.6273 25.9505 15.3491 5.3757 22.4276 24.7654 11.3874 12.9726 21.8112 13.1465 28.0974 13.8315 18.2379 13.1934
temp: 298.150 k
press: 1.00000 atm
elementType: 17 7 6 6 6 6 6 6 6 6 6 6 6 1 1 1 1 1 1 1 1 1 1
symmnumber: 1
zpe: 467715.9 jmol-1
zpe.correction: 0.178144 hartree
zpe.thermalcorrener: 0.189406 hartree
zpe.thermalcorrenthalpy: 0.190350 hartree
zpe.thermalcorrgfe: 0.140998 hartree
zpe.sumelectzpe: -939.072145 hartree
zpe.sumelectthermal: -939.060883 hartree
zpe.sumelectthermalent: -939.059939 hartree
zpe.sumelectthermalfe: -939.109291 hartree
dipole: -0.2093 1.2164 0.0001
dipole: 1.2343
quadrupole: -69.8521 -84.8504 -86.2867
quadrupole: 5.4902 -0.0004 0.0002
quadrupole: 10.4776 -4.5207 -5.9570 5.4902 -0.0004 0.0002
hfenergy: -939.2502887 hartree
pointgroup: C01 [X(C11H10Cl1N1)]
dipole: -0.00294 -0.4855929 0.0001373 debye
dipolederiv: -0.2035223 0.1780282 -0.0000432 0.2539363 -0.7482476 0.0001383 -0.0000426 0.0001289 -0.0609943 -0.3811375 0.0663231 -0.0000332 0.0683425 -0.3860659 0.0000343 -0.0000388 0.0000298 -0.225869 -0.0392151 0.0224223 -0.0000192 0.3128851 -0.4722995 0.0001376 -0.0001052 0.0001134 0.0631939 -0.0367179 -0.0958159 0.0000284 0.0577524 0.3732316 -0.0000993 -0.0000069 -0.0000826 -0.0352156 0.2499367 0.1616481 -0.0000008 -0.2356719 0.0977596 -0.000023 0.0000887 0.00001 0.0528026 0.2389646 -0.1224639 0.0000451 -0.4155784 1.1099984 -0.0002345 0.0000975 -0.0002083 -0.0897114 0.2062248 -0.12835 0.0000393 -0.2117052 -0.5189464 0.0000812 0.0000645 0.0000905 0.0508633 -0.0040833 0.2222573 -0.0000416 0.0618625 -0.0615184 -0.0000201 -0.0000058 -0.0000073 -0.1672907 -0.1372136 -0.0673231 0.0000183 -0.0280611 0.0454626 -0.0000474 0.0000084 -0.0000478 -0.1597184 0.0522524 0.0936213 -0.0000429 0.0038973 -0.179342 0.0000587 -0.000018 0.0000225 0.045713 0.102482 -0.1003482 0.0000534 -0.0807928 0.0587239 -0.0000576 0.0000607 -0.00007 -0.1358265 0.1563047 -0.1024264 0.0000563 0.1936236 0.4732637 -0.0000871 0.0000095 -0.0001097 -0.0928745 -0.1113417 0.0886144 -0.0000327 0.200886 0.0817179 0.0000096 -0.0000803 -0.0000156 0.0430899 -0.0470588 -0.0899438 0.0000039 -0.1304502 -0.0070542 0.0000318 0.0000195 0.0000429 0.1469111 0.0907963 -0.0067959 -0.0000063 0.0462066 -0.046488 0.0000515 -0.0000254 0.0000452 0.1599415 -0.1585186 -0.1544705 0.0000767 -0.0210158 0.0596989 0.0000181 0.0000244 0.0000314 0.1080044 0.0785406 0.0494362 0.0930749 0.013366 0.0124099 -0.0331501 0.0677854 -0.0639202 -0.0269048 0.078516 0.0494025 -0.0931241 0.0133387 0.0124933 0.033107 -0.0678089 0.063883 -0.0269142 -0.077845 -0.1007311 -0.0000025 -0.0869725 0.0073192 0.0000111 -0.0000079 0.0000147 0.1254099 -0.0995729 0.0862853 -0.0000514 0.0712474 0.0565886 0.0000347 -0.0000446 0.0000373 0.1580483 0.0114491 -0.0535839 0.0000109 -0.1818466 -0.070166 0.0000403 0.0000442 0.0000456 0.1122645 0.0153758 0.0021014 -0.0075438 0.0473528 0.0507818 0.101312 -0.0640809 0.0792381 -0.0225227 0.0153835 0.0021127 0.0075347 0.0473972 0.0506788 -0.1013475 0.0640624 -0.0792716 -0.0224004 unknown
polarizability: 194.0308521|-1.8844982|156.2931206|0.0130876|-0.0204342|61.3912918 unknown
InChI: InChI=1S/C11H10ClN/c1-7-4-3-5-9-10(7)11(12)8(2)6-13-9/h3-6H,1-2H3
charge 0 multiplicity 1
23 atoms
Cl 1.636244 -2.439466 0.00097
N  0.568535 2.102242 0.000024
C  -0.264984 -0.274846 0.000453
C  -1.441615 -1.131513 0.000568
C  -0.46871 1.1784 0.000107
C  1.123348 -0.676498 0.000642
C  2.181494 0.246071 0.000566
C  -2.709378 -0.52201 0.000284
C  -1.787965 1.729559 -0.000175
C  -1.41508 -2.655204 0.000983
C  -2.899157 0.890922 -0.000106
C  1.82382 1.634716 0.000258
C  3.641709 -0.151564 0.000762
H  -3.5926 -1.171786 0.000377
H  -1.865124 2.820325 -0.000429
H  -2.451475 -3.035801 0.001239
H  -0.898388 -3.065884 -0.883829
H  -0.898129 -3.065391 0.885867
H  2.627751 2.381879 0.000212
H  -3.913896 1.30325 -0.000332
H  4.283118 0.746622 0.000544
H  3.894688 -0.761403 0.887719
H  3.894793 -0.761919 -0.885807
