program: Gaussian 09
title: 000219128
version: EM64L-G09RevD.01
frameworkgroup: C1[X(C21H19I)]
method: RPBEPBE
basis: SDD
operation: Freq
keyword: #pfreq=noraman
keyword: PBEPBE/SDD
title: #p freq=noraman PBEPBE/SDD
converged: YES YES NO NO
title: Mulliken charges:
elementType: I C C C C C C C C C C C C C C C C C C C C C H H H H H H H H H H H H H H H H H H H
charge: 0.015993 0.035680 -0.417402 0.413814 0.332374 0.376890 -0.848270 -0.392744 -0.380509 -0.410068 -0.369014 -0.386434 -0.347181 -0.257190 -0.259608 -0.259514 -0.250549 -0.254093 -0.262893 -0.248773 -0.246118 -0.244641 0.257401 0.227073 0.308745 0.322018 0.260554 0.261077 0.243484 0.215748 0.263881 0.245589 0.227107 0.229121 0.227649 0.224885 0.227587 0.228199 0.229680 0.230419 0.230032
chargesum: 0.00000
title: Mulliken charges with hydrogens summed into heavy atoms:
elementType: I C C C C C C C C C C C C C C C C C C C C C
charge: 0.015993 0.035680 0.067072 0.413814 0.332374 0.376890 -0.217507 -0.132190 -0.119432 -0.166583 -0.153266 -0.122553 -0.101591 -0.030083 -0.030487 -0.031865 -0.025663 -0.026507 -0.034695 -0.019092 -0.015699 -0.014609
polarizability: 2.46853811e+02 1.56145940e+01 2.41790505e+02 1.81374253e+00 -1.97997519e+00 2.29072970e+02
1716.lowfreq: -10.4183 -8.2907 -0.0004 0.0004 0.0006 6.5759 26.0880 30.5416 46.1842
frequency: 25.5800 30.3771 46.1563 54.2034 58.3432 68.4620 78.9754 98.3710 143.2705 151.3187 215.0010 225.5504 251.6641 272.4243 279.0632 293.9674 323.0053 334.7471 400.3216 407.7601 411.4700 451.0072 481.5033 526.3161 544.9464 602.1336 611.7647 615.6068 617.7784 619.5861 648.2284 691.1484 701.8184 708.8978 713.6635 749.4600 754.4200 769.3286 781.2099 840.5353 849.3526 857.9650 862.4463 883.5837 921.4842 934.3697 935.6902 973.1177 977.3256 983.2456 986.6504 990.0503 991.0046 991.4099 995.5067 996.2210 999.3529 1003.9653 1031.1128 1031.4411 1033.0158 1062.9371 1085.5887 1088.8015 1097.1263 1123.7385 1159.7391 1170.1432 1173.6802 1174.1382 1174.3897 1196.1301 1197.8099 1200.9046 1204.6701 1220.2618 1298.1001 1315.4559 1320.4561 1326.6177 1329.9666 1369.8530 1375.8554 1376.8823 1428.8306 1434.9688 1436.9453 1452.4236 1476.1504 1480.5007 1481.2219 1488.0096 1583.3360 1588.2611 1589.7523 1607.0681 1607.7564 1611.7169 3021.5477 3070.0860 3077.0033 3121.6231 3123.0029 3123.1634 3128.6816 3129.9104 3130.8337 3141.4913 3143.3933 3145.1944 3150.2664 3151.8713 3152.2911 3157.2905 3164.7166 3165.0011 3165.5962
redmass: 6.7462 3.8478 4.7186 5.6952 4.4736 4.5404 5.4797 4.0989 2.9987 6.1757 4.3977 3.9608 4.1858 4.4425 5.4622 4.4700 3.9339 2.9262 2.8009 2.8581 2.8848 4.3823 3.6740 3.4407 4.4130 4.2107 4.6232 6.3073 6.3650 6.1516 5.1756 5.2159 1.8135 1.6274 1.6647 1.3404 1.7086 2.2968 1.8873 2.1416 1.2652 1.2786 1.2634 3.1319 1.4239 1.6866 1.4331 1.6960 1.4026 1.3852 1.4608 5.6426 5.1678 4.8853 1.4579 1.4467 1.3190 3.3827 2.2036 2.3075 2.2504 3.8900 1.6485 1.6051 1.7060 1.4777 3.1582 2.3738 1.0557 1.0813 1.0583 1.1475 1.1206 1.1857 1.3131 2.2074 1.2529 1.3852 1.3258 1.3374 1.3362 5.0265 7.2908 7.1431 2.2238 2.2375 2.2447 1.1084 1.5102 2.0770 1.9443 1.4972 5.7272 5.9026 6.1436 6.0332 5.9453 6.0144 1.0598 1.0571 1.1017 1.0851 1.0844 1.0844 1.0873 1.0873 1.0876 1.0928 1.0919 1.0917 1.0955 1.0955 1.0947 1.1089 1.1012 1.1011 1.1011
irintensity: 0.2051 0.0570 0.1003 0.0416 0.0950 0.0677 0.3164 0.2357 0.9744 0.1214 0.8112 0.8714 0.2864 0.5466 0.1876 0.7451 0.4242 0.8658 0.0603 0.2585 0.0240 2.8534 4.4446 4.2561 66.7171 7.0180 9.5744 0.4529 0.3423 2.5655 4.4841 2.0629 31.4869 97.6377 25.4420 25.1422 46.1774 33.5689 23.9532 1.4066 0.0894 0.6856 0.2652 2.7023 0.7229 4.3129 0.6116 4.7830 0.0941 0.5015 0.4474 0.8289 1.2126 0.7959 0.3956 1.0308 0.1771 1.6772 17.7144 5.9926 4.7907 2.4414 4.3637 1.9145 11.8923 1.2841 1.4312 1.8245 0.0637 0.1370 0.0709 3.2824 3.4866 1.2202 26.1281 14.2810 3.0208 7.5445 7.9638 0.7185 11.9813 1.4074 0.3521 1.4870 4.2196 11.8682 8.5431 7.4129 36.9076 29.4710 12.1462 12.2987 0.7196 2.0327 0.2234 12.6993 11.0796 2.7300 12.8731 8.3449 15.5735 4.6865 3.5532 1.8877 0.9826 0.6849 3.8305 25.2393 30.1956 18.4502 16.2742 51.2716 21.7988 7.2538 28.2334 29.8676 5.0520
temp: 298.150 k
press: 1.00000 atm
elementType: 53 6 6 6 6 6 6 6 6 6 6 6 6 6 6 6 6 6 6 6 6 6 1 1 1 1 1 1 1 1 1 1 1 1 1 1 1 1 1 1 1
symmnumber: 1
zpe: 870886.5 jmol-1
zpe.correction: 0.331703 hartree
zpe.thermalcorrener: 0.350977 hartree
zpe.thermalcorrenthalpy: 0.351921 hartree
zpe.thermalcorrgfe: 0.281067 hartree
zpe.sumelectzpe: -821.598824 hartree
zpe.sumelectthermal: -821.579551 hartree
zpe.sumelectthermalent: -821.578606 hartree
zpe.sumelectthermalfe: -821.649460 hartree
dipole: 2.5165 0.4570 -0.6590
dipole: 2.6412
quadrupole: -148.8276 -133.7450 -136.2869
quadrupole: 2.3952 1.1575 -0.4094
quadrupole: -9.2078 5.8749 3.3329 2.3952 1.1575 -0.4094
hfenergy: -821.9305273 hartree
pointgroup: C01 [X(C21H19I1)]
dipole: -0.3304876 -0.0263956 -0.9848172 debye
polarizability: 232.7833412|3.4982454|237.0566165|4.8231421|15.4569538|247.8773276 unknown
InChI: InChI=1S/C21H19I/c22-17-16-21(18-10-4-1-5-11-18,19-12-6-2-7-13-19)20-14-8-3-9-15-20/h1-15H,16-17H2
charge 0 multiplicity 1
41 atoms
I  2.216918 0.035577 4.467939
C  0.028705 -0.053937 0.425534
C  0.369032 -0.161433 1.963634
C  -1.481576 -0.395609 0.216409
C  0.958959 -1.074848 -0.288949
C  0.205556 1.394218 -0.119465
C  1.869516 -0.059225 2.269829
C  -1.92995 -1.096521 -0.933942
C  0.740307 -2.466691 -0.095963
C  0.483754 2.508061 0.712076
C  -2.462802 0.084002 1.12371
C  2.106313 -0.678166 -1.020286
C  0.012304 1.637164 -1.507224
C  -3.304991 -1.322999 -1.16256
C  1.625406 -3.426544 -0.629267
C  0.573724 3.815331 0.177569
C  -3.838419 -0.142626 0.900255
C  2.996182 -1.637506 -1.558085
C  0.102836 2.936434 -2.04493
C  -4.269194 -0.849381 -0.245044
C  2.760467 -3.01656 -1.368193
C  0.38665 4.037896 -1.20305
H  -0.004394 -1.13439 2.329672
H  -0.175205 0.614036 2.528325
H  2.341013 0.856053 1.884275
H  2.436536 -0.942598 1.947249
H  -1.200447 -1.480169 -1.654771
H  -0.134309 -2.802208 0.473552
H  0.625586 2.381229 1.790148
H  -2.16546 0.654125 2.009811
H  2.311353 0.385964 -1.173465
H  -0.223016 0.799422 -2.17267
H  -3.62104 -1.869002 -2.0588
H  1.430573 -4.49279 -0.467655
H  0.789073 4.656913 0.845697
H  -4.573028 0.238117 1.618935
H  3.874998 -1.30294 -2.120946
H  -0.054276 3.091164 -3.118392
H  -5.336403 -1.024686 -0.420389
H  3.449368 -3.760116 -1.784121
H  0.454679 5.050245 -1.616348
