program: Gaussian 09
title: 000219124
version: EM64L-G09RevD.01
frameworkgroup: C1[X(C26H22O2)]
method: RPBEPBE
basis: SDD
operation: Freq
keyword: #pfreq=noraman
keyword: PBEPBE/SDD
title: #p freq=noraman PBEPBE/SDD
converged: YES YES NO NO
title: Mulliken charges:
elementType: O O C C C C C C C C C C C C C C C C C C C C C C C C C C H H H H H H H H H H H H H H H H H H H H H H
charge: -0.277879 -0.277553 0.190519 0.190524 0.226818 0.226908 -0.307265 -0.306847 0.344688 0.344412 -0.373758 -0.373900 -0.360535 -0.359974 -0.354489 -0.354513 -0.411453 -0.411367 -0.260579 -0.260677 -0.245398 -0.245482 -0.237476 -0.237532 -0.238466 -0.238433 -0.249008 -0.249034 0.230059 0.204486 0.229864 0.204531 0.247903 0.247867 0.246704 0.246483 0.249222 0.249293 0.241364 0.241397 0.227932 0.227965 0.226802 0.226766 0.229101 0.228984 0.223084 0.223104 0.227422 0.227418
chargesum: 0.00000
title: Mulliken charges with hydrogens summed into heavy atoms:
elementType: O O C C C C C C C C C C C C C C C C C C C C C C C C C C
charge: -0.277879 -0.277553 0.190519 0.190524 0.226818 0.226908 0.127280 0.127548 0.344688 0.344412 -0.125856 -0.126033 -0.113831 -0.113491 -0.105267 -0.105219 -0.170090 -0.169970 -0.032647 -0.032712 -0.018596 -0.018715 -0.008375 -0.008548 -0.015382 -0.015329 -0.021587 -0.021616
polarizability: 3.31862608e+02 3.80288534e+01 3.03993565e+02 5.11807936e-01 -1.36855089e-01 2.40991864e+02
1716.lowfreq: -0.0006 -0.0005 -0.0004 5.1104 5.9748 8.6560 12.7080 18.7906 20.1034
frequency: 12.5992 18.6325 19.1475 43.2188 45.0957 65.2687 78.6700 83.1781 94.1992 117.0715 123.7710 153.2214 168.6956 211.7827 215.3489 245.6713 277.0576 282.0240 293.9387 310.5015 335.1452 335.3197 404.5848 405.5921 431.0215 432.7180 436.6887 491.6801 493.6460 530.9976 534.2891 564.1039 564.8931 576.8220 608.6015 608.7692 612.2228 619.7720 622.8298 699.6392 701.5711 716.4641 723.1059 729.8593 730.3333 754.6984 754.8351 775.0361 775.9597 780.9240 781.0640 846.5713 848.5487 849.9942 850.4550 907.4749 914.5921 917.8964 921.3284 935.9964 936.6353 972.1695 972.8432 973.4612 974.0433 987.0880 988.4572 992.3732 993.0508 994.1867 995.0847 1032.7149 1036.5203 1036.5968 1043.0514 1056.0746 1056.7838 1082.8908 1083.3753 1108.4417 1122.8725 1124.2584 1172.6611 1172.7863 1176.6003 1177.2724 1195.6062 1195.6792 1203.0615 1208.9631 1217.8481 1258.6167 1262.6699 1269.4359 1289.0717 1289.9139 1320.5871 1320.9938 1357.7586 1364.6747 1373.2219 1373.3896 1378.0450 1397.3367 1423.1002 1423.7759 1443.3475 1443.5819 1456.3376 1458.0479 1473.7581 1474.5985 1501.1345 1502.1752 1577.0360 1577.5471 1590.1172 1590.5897 1603.0258 1604.5159 1611.7569 1612.3247 2958.0375 2970.1343 3027.7195 3038.4973 3120.1320 3120.2868 3129.0123 3129.0783 3130.7197 3130.8489 3140.0976 3140.2935 3142.9477 3142.9980 3158.1980 3158.3545 3158.8053 3159.4198 3171.2829 3172.3046 3177.3066 3178.5308
redmass: 5.5794 5.5534 4.9675 4.2894 4.2780 5.2570 5.4078 4.4814 4.0528 3.7865 5.7768 4.9698 3.3290 5.3082 5.0005 2.9136 4.2784 4.0839 5.8957 4.7818 3.9464 4.0554 2.8379 2.8516 3.9708 3.6588 3.7427 3.4998 3.4603 3.9618 3.9984 3.4234 3.4625 7.2476 6.8077 6.8164 5.3337 6.4253 5.2444 1.7231 1.7735 4.9199 4.4461 2.7345 2.7430 1.4540 1.4294 2.2094 2.0507 3.4415 3.9378 1.2566 1.3706 1.4394 1.3344 3.2751 1.6029 1.4099 2.5061 1.4032 1.4347 1.3651 1.3380 1.3476 1.3711 5.1787 5.1694 1.9483 1.8183 2.7292 3.0583 2.6397 2.0669 2.0748 2.4282 2.1012 2.0585 1.6301 1.6352 2.0976 1.7672 1.8251 1.0522 1.0525 1.0724 1.0686 1.1181 1.1172 2.1495 1.3244 3.4015 1.3255 1.9560 1.6253 1.8795 1.8559 1.3661 1.3639 1.6708 3.4939 5.1887 6.1552 3.1208 1.8203 2.3185 2.3216 2.3557 2.3602 1.1618 1.2548 2.0400 1.8181 2.6245 2.7072 5.7809 5.8166 6.8927 6.9970 6.4169 6.3740 6.0848 6.0569 1.0564 1.0584 1.1054 1.1047 1.0847 1.0847 1.0875 1.0874 1.0858 1.0857 1.0907 1.0910 1.0932 1.0933 1.0966 1.0979 1.0964 1.0946 1.0991 1.0986 1.0964 1.0955
irintensity: 0.0058 0.0107 0.0668 0.0262 0.8455 0.4295 1.5109 4.7953 0.2428 0.3547 1.1611 0.0003 1.9500 0.0023 0.3300 4.3595 0.3995 0.6926 0.7268 0.4931 0.3466 0.4015 0.2611 0.0003 1.5835 5.0878 4.4110 0.9566 4.5125 0.8038 3.0156 1.9581 6.0124 0.2688 6.7328 3.6233 10.5598 0.7626 4.8417 25.1200 61.1535 9.6491 10.9689 34.6158 21.4335 80.9259 100.3507 28.9773 27.6139 1.2645 0.3495 1.1886 0.1320 2.1851 0.2401 19.5867 22.1399 3.0465 60.5849 0.9251 14.3541 1.3296 0.1852 0.0909 0.0120 1.4004 1.3658 3.8792 1.1962 5.5501 3.7758 16.7879 4.0653 4.1544 15.2970 49.2925 1.0918 0.8802 17.6439 0.9152 46.9880 31.7111 1.1582 0.2058 11.0524 5.5203 0.1138 0.1922 236.2450 118.5153 47.7028 13.7082 57.9317 0.2849 4.6518 1.9408 0.7494 0.0833 22.8858 1.1791 1.2360 2.3988 5.3832 5.0896 90.0630 12.3639 2.8249 6.5396 0.8418 126.2009 3.1621 47.3816 37.3604 9.5240 3.1738 4.2088 19.4175 5.0161 39.3395 2.3941 4.3010 4.1729 10.4848 77.6574 20.8080 41.1693 3.9782 3.7621 6.2332 4.2526 1.0072 0.4072 23.6086 22.4629 29.9516 6.6012 37.3479 22.6203 52.2752 35.2209 19.2357 17.5505 12.4833 2.2741
temp: 298.150 k
press: 1.00000 atm
elementType: 8 8 6 6 6 6 6 6 6 6 6 6 6 6 6 6 6 6 6 6 6 6 6 6 6 6 6 6 1 1 1 1 1 1 1 1 1 1 1 1 1 1 1 1 1 1 1 1 1 1
symmnumber: 1
zpe: 1052391.3 jmol-1
zpe.correction: 0.400835 hartree
zpe.thermalcorrener: 0.424268 hartree
zpe.thermalcorrenthalpy: 0.425212 hartree
zpe.thermalcorrgfe: 0.344521 hartree
zpe.sumelectzpe: -1152.458077 hartree
zpe.sumelectthermal: -1152.434644 hartree
zpe.sumelectthermalent: -1152.433700 hartree
zpe.sumelectthermalfe: -1152.514391 hartree
dipole: -0.0127 -0.0090 -2.5337
dipole: 2.5338
quadrupole: -150.4280 -153.6873 -152.0245
quadrupole: 4.8659 0.0906 0.0460
quadrupole: 1.6186 -1.6407 0.0221 4.8659 0.0906 0.0460
hfenergy: -1152.858912 hartree
pointgroup: C01 [X(C26H22O2)]
dipole: -0.0201988 0.0395725 0.9958647 debye
polarizability: 340.9958777|-33.2192791|294.7287404|2.2185602|-2.6737745|241.1234188 unknown
InChI: InChI=1S/C26H22O2/c1-3-11-21(12-4-1)23-15-7-9-17-25(23)27-19-20-28-26-18-10-8-16-24(26)22-13-5-2-6-14-22/h1-18H,19-20H2
charge 0 multiplicity 1
50 atoms
O  -1.467488 -0.025039 1.346136
O  1.480868 0.235177 1.389484
C  -3.515545 -0.106302 0.074305
C  3.567466 0.190604 0.179331
C  -2.735428 0.5300 1.092888
C  2.748842 -0.351302 1.222132
C  -0.663623 0.544489 2.434388
C  0.635847 -0.241797 2.490471
C  -3.036627 -1.283652 -0.711198
C  3.128324 1.30635 -0.712157
C  -4.809232 0.423933 -0.173434
C  4.860598 -0.372461 0.014984
C  -3.241195 1.638187 1.815266
C  3.219116 -1.401129 2.048362
C  -1.697934 -1.390603 -1.180876
C  1.8057 1.391167 -1.229484
C  -3.949292 -2.321756 -1.051934
C  4.065024 2.303499 -1.105882
C  -5.323323 1.527833 0.540821
C  5.338961 -1.419312 0.83254
C  -4.533073 2.136523 1.538164
C  4.511923 -1.934286 1.852408
C  -1.293029 -2.487835 -1.970396
C  1.439469 2.427411 -2.114526
C  -3.543631 -3.422014 -1.837456
C  3.698009 3.343032 -1.987276
C  -2.211957 -3.509729 -2.304583
C  2.381909 3.409093 -2.499932
H  -0.44813 1.61437 2.244286
H  -1.207005 0.442392 3.396891
H  0.423889 -1.323695 2.38164
H  1.145002 -0.061207 3.460176
H  -5.410357 -0.028822 -0.969656
H  5.490973 0.006905 -0.796843
H  -2.639495 2.117019 2.592636
H  2.590427 -1.80941 2.84469
H  -0.976203 -0.611577 -0.922486
H  1.065966 0.643293 -0.932845
H  -4.977322 -2.279976 -0.673543
H  5.080804 2.279545 -0.694325
H  -6.322323 1.91258 0.311595
H  6.338967 -1.832602 0.665965
H  -4.911514 2.998303 2.09874
H  4.862284 -2.750694 2.493413
H  -0.257739 -2.54331 -2.325716
H  0.415842 2.466798 -2.504146
H  -4.263622 -4.212764 -2.077389
H  4.435681 4.104047 -2.26643
H  -1.893871 -4.362623 -2.914658
H  2.093671 4.214951 -3.184243
