program: Gaussian 09
title: 000219118
version: EM64L-G09RevD.01
frameworkgroup: C1[X(C18H25N)]
method: RPBEPBE
basis: SDD
operation: Freq
keyword: #pfreq=noraman
keyword: PBEPBE/SDD
title: #p freq=noraman PBEPBE/SDD
converged: YES YES NO NO
title: Mulliken charges:
elementType: N C C C C C C C C C C C C C C C C C C H H H H H H H H H H H H H H H H H H H H H H H H H
charge: -0.069928 -0.164045 -0.334159 -0.514672 -0.447102 -0.476247 -0.558338 0.335998 0.090809 -0.577350 0.339513 -0.373880 -0.415127 -0.405344 -0.240171 -0.241348 -0.617921 -0.623115 -0.250105 0.229469 0.244907 0.227561 0.224724 0.221397 0.210775 0.222728 0.228109 0.229417 0.219575 0.228972 0.223409 0.188388 0.234990 0.229984 0.236973 0.222643 0.223388 0.229587 0.184396 0.219622 0.219785 0.183273 0.231515 0.226942
chargesum: 0.00000
title: Mulliken charges with hydrogens summed into heavy atoms:
elementType: N C C C C C C C C C C C C C C C C C C
charge: -0.069928 0.065425 -0.089252 -0.062386 -0.014930 -0.025410 -0.109345 0.335998 0.090809 -0.124969 0.339513 0.049498 -0.185144 -0.168371 -0.017528 -0.017959 0.015684 0.011458 -0.023164
polarizability: 2.09251562e+02 2.69655334e+01 2.22066457e+02 1.35392306e+01 -5.23224928e+00 1.62157973e+02
1716.lowfreq: -13.4260 -8.4272 -5.8874 -0.0006 0.0003 0.0006 7.5747 26.2251 33.5085
frequency: -8.8462 26.1031 33.4383 50.0640 58.2506 82.2878 104.8249 114.7173 189.6199 207.4542 214.0962 242.6927 250.6793 263.2989 299.8186 326.5448 341.4085 369.3629 403.7806 404.9412 427.4868 446.3300 472.6849 507.8335 557.7385 589.2387 614.2163 639.1636 668.7116 703.2945 753.6163 762.5377 774.7352 789.2589 800.2028 825.0410 835.5184 849.7429 860.8951 882.2474 915.6262 921.9577 935.0130 951.6440 956.5589 970.0387 973.3774 988.7939 991.1203 1008.5194 1022.9879 1032.6346 1034.9010 1040.8941 1042.0018 1053.1283 1062.3875 1080.6329 1091.3415 1096.1543 1107.4521 1127.6863 1134.7820 1156.4502 1165.7219 1171.1509 1178.6113 1190.3228 1195.5645 1223.2239 1226.3476 1246.2355 1260.4777 1262.5010 1270.4789 1282.9698 1291.1963 1295.1059 1299.3541 1305.2413 1313.9499 1321.3454 1365.0523 1369.7015 1417.8608 1430.7748 1440.3041 1447.7388 1460.1542 1463.1470 1463.7756 1468.9123 1475.3771 1477.4856 1480.0976 1482.7522 1487.8146 1488.5530 1579.4425 1607.4729 1665.9159 2826.7330 2836.6993 2856.5750 2979.4149 2992.3825 3001.8619 3004.2021 3008.0998 3015.7713 3020.3596 3026.9284 3042.1256 3053.0160 3060.3641 3064.2858 3072.5033 3075.4561 3076.6955 3079.4266 3084.5571 3118.4276 3124.6304 3139.2270 3148.0021 3162.2617
redmass: 3.0393 3.3900 3.5439 3.8076 3.1340 3.6574 2.2761 3.2651 2.8531 2.9900 2.4235 1.1704 1.2309 2.7637 2.6608 2.7391 2.6080 1.9371 2.8104 2.7387 2.5821 2.0614 2.8112 3.4841 3.8235 4.1406 6.0845 3.8581 4.1121 1.6414 2.1943 2.9507 2.2247 2.3021 1.4252 3.3579 2.5840 1.2790 2.2625 2.5765 1.6436 1.7597 2.0939 2.1863 2.0089 1.7601 1.3994 5.5434 1.3262 2.9381 2.5177 1.5270 1.6149 1.7795 2.0579 1.9395 2.0615 1.5158 1.3073 1.5936 1.1673 1.3081 1.4145 1.5388 1.6413 1.0644 2.2270 1.1546 1.4100 1.4572 1.5802 1.5690 2.3344 1.4297 1.8151 1.8703 1.5025 1.2851 1.5837 1.6402 1.5862 1.4965 1.3302 6.2394 1.1415 2.2855 1.1564 1.0851 1.0623 1.0818 1.0682 1.0917 1.0694 1.0624 1.9137 1.1697 1.0910 1.0811 5.8591 6.0954 10.0590 1.0696 1.0577 1.0582 1.0624 1.0603 1.0597 1.0594 1.0624 1.0720 1.0857 1.0729 1.1003 1.1017 1.0974 1.0926 1.1046 1.0989 1.0946 1.1050 1.0998 1.0841 1.0873 1.0924 1.0954 1.1013
irintensity: 0.2117 0.1170 0.2895 0.2403 0.0877 0.0667 0.7529 0.3989 1.8623 1.2274 0.1583 1.3011 0.6474 0.0951 0.1749 1.4470 7.0539 1.6838 0.0451 0.1786 3.6438 1.1253 3.8944 1.4291 3.8542 9.6451 0.1465 0.1972 12.5362 55.2868 1.5075 7.8878 37.4752 1.2669 2.6307 11.5255 5.4441 0.0675 1.4640 2.3403 2.9202 0.5282 4.7102 5.6627 2.5472 1.3098 0.2517 0.0346 0.1059 15.5260 8.9107 16.5956 6.3243 5.1414 8.9841 15.2160 25.7930 5.2980 4.6189 7.6212 0.4917 4.0928 6.5940 2.2519 11.3187 0.6771 6.9270 0.5054 1.5962 4.5515 0.9483 2.5441 6.2989 1.9316 2.2821 1.5368 2.1337 16.5368 1.6696 3.0033 0.0340 3.4063 6.2229 0.4891 3.5197 6.2793 2.1178 8.5355 10.9190 3.2326 21.8003 14.0485 7.8493 13.3672 19.4682 10.2132 9.2381 16.3288 2.3723 13.4102 8.5332 53.0866 73.8702 214.4489 25.3963 27.7403 14.2005 55.0568 68.1789 43.5383 22.8202 40.9201 14.6408 11.6518 39.0899 61.8563 21.4682 18.9384 58.1384 97.2971 44.1470 4.7968 1.2317 25.3588 43.3558 20.9015
temp: 298.150 k
press: 1.00000 atm
elementType: 7 6 6 6 6 6 6 6 6 6 6 6 6 6 6 6 6 6 6 1 1 1 1 1 1 1 1 1 1 1 1 1 1 1 1 1 1 1 1 1 1 1 1 1
symmnumber: 1
zpe: 1010139.3 jmol-1
zpe.correction: 0.384742 hartree
zpe.thermalcorrener: 0.402253 hartree
zpe.thermalcorrenthalpy: 0.403197 hartree
zpe.thermalcorrgfe: 0.338220 hartree
zpe.sumelectzpe: -754.189138 hartree
zpe.sumelectthermal: -754.171627 hartree
zpe.sumelectthermalent: -754.170683 hartree
zpe.sumelectthermalfe: -754.235661 hartree
dipole: -0.7481 -0.7498 -0.7033
dipole: 1.2714
quadrupole: -114.7175 -109.1073 -113.3672
quadrupole: 1.5388 0.1293 -0.6555
quadrupole: -2.3202 3.2900 -0.9699 1.5388 0.1293 -0.6555
hfenergy: -754.5738801 hartree
pointgroup: C01 [X(C18H25N1)]
dipole: -0.3788798 -0.1699764 0.2788819 debye
polarizability: 235.6676288|19.8640398|192.4147195|2.3032421|-16.6299019|165.3936446 unknown
InChI: InChI=1S/C18H25N/c1-19(2)11-10-17(15-6-4-3-5-7-15)18-13-14-8-9-16(18)12-14/h3-7,14,16H,8-13H2,1-2H3
charge 0 multiplicity 1
44 atoms
N  -1.2992 3.600347 -0.456772
C  -1.444693 -3.355575 0.872977
C  -2.249523 -1.323783 0.206053
C  -2.521436 -2.341399 1.356142
C  -1.887387 -3.617992 -0.600569
C  -2.496498 -2.235277 -1.047573
C  -0.179702 -2.446327 0.865575
C  -0.731263 -1.11976 0.305299
C  -0.021435 -0.043329 -0.154633
C  -0.716601 1.159731 -0.793101
C  1.474107 0.033552 -0.051063
C  -0.797098 2.361331 0.184601
C  2.264505 0.422505 -1.169906
C  2.152073 -0.252189 1.16728
C  3.671331 0.501664 -1.080931
C  3.558218 -0.167591 1.262244
C  -1.028715 4.796634 0.367117
C  -2.721503 3.519832 -0.845183
C  4.327904 0.206452 0.13643
H  -1.327427 -4.268922 1.478843
H  -2.854286 -0.40426 0.218481
H  -2.313772 -1.934419 2.362093
H  -3.549752 -2.745653 1.331188
H  -2.643261 -4.422772 -0.648945
H  -1.033296 -3.92324 -1.231481
H  -2.013617 -1.830115 -1.953443
H  -3.581206 -2.321188 -1.247296
H  0.6525 -2.848437 0.258845
H  0.196659 -2.335151 1.9011
H  -1.726087 0.87853 -1.139211
H  -0.159552 1.508051 -1.683202
H  -1.420703 2.067902 1.070896
H  0.221713 2.568269 0.562929
H  1.775275 0.647762 -2.124451
H  1.565498 -0.516111 2.053764
H  4.255196 0.793579 -1.961564
H  4.052123 -0.384766 2.216536
H  0.054397 4.870107 0.57053
H  -1.566011 4.792668 1.350668
H  -1.335896 5.704763 -0.182935
H  -3.021303 4.459845 -1.342322
H  -3.406279 3.356156 0.02789
H  -2.878997 2.697019 -1.562805
H  5.4194 0.272461 0.207606
