program: Gaussian 09
title: 000219111
version: EM64L-G09RevD.01
frameworkgroup: C1[X(C13H18ClN3O3S)]
method: RPBEPBE
basis: SDD
operation: Freq
keyword: #p
keyword: freq=noraman
keyword: PBEPBE/SDD
title: #p freq=noraman PBEPBE/SDD
converged: NO YES NO NO
title: Mulliken charges:
elementType: Cl S O O O N N N C C C C C C C C C C C C C H H H H H H H H H H H H H H H H H H
charge: -0.032824 1.000869 -0.264705 -0.480823 -0.547935 -0.002185 -0.394674 -0.677283 -0.392875 -0.406686 -0.390189 -0.370376 -0.352193 -0.395116 0.417710 -0.050050 -0.159293 -0.246802 -0.205817 -0.185979 -0.095845 0.191032 0.206797 0.198677 0.206368 0.215849 0.204147 0.205679 0.190987 0.166502 0.233769 0.213469 0.241214 0.264346 0.339222 0.316902 0.299376 0.270024 0.268711
chargesum: 0.00000
title: Mulliken charges with hydrogens summed into heavy atoms:
elementType: Cl S O O O N N N C C C C C C C C C C C C C
charge: -0.032824 1.000869 -0.264705 -0.480823 -0.547935 -0.002185 -0.130328 -0.338061 0.004954 -0.001641 0.029807 0.026290 0.048078 0.059566 0.417710 -0.050050 0.157609 0.052574 0.064208 0.082732 -0.095845
polarizability: 2.74915410e+02 2.27443146e+01 1.98427265e+02 1.22281442e+01 -1.39849280e+01 1.65380197e+02
1716.lowfreq: -10.3015 -6.6543 -0.0020 -0.0011 -0.0005 2.9168 10.4675 17.6678 32.4322
frequency: 10.2140 17.6487 32.3819 38.4781 43.6505 66.9660 79.7787 95.8563 122.6817 124.4625 146.8444 178.1091 200.6515 210.9814 237.1822 257.3137 272.2010 276.9074 291.1258 317.6800 347.2014 358.4710 372.1324 386.3688 398.2891 409.8981 412.8968 453.3964 480.5137 482.5540 497.4600 522.4375 532.0169 610.2824 648.6902 686.7154 698.0103 701.7015 733.7042 741.0201 803.1785 809.4398 811.1396 815.9094 834.8304 839.4036 856.8519 937.0134 944.3850 957.4299 958.9776 967.0578 971.9549 979.3286 981.3185 1007.4933 1044.6404 1055.8604 1065.8676 1090.4704 1108.8280 1112.0166 1128.1935 1151.1532 1173.8864 1179.7803 1185.8726 1205.8084 1239.8412 1270.6076 1286.1909 1289.4958 1303.9488 1313.6484 1336.3367 1342.3625 1346.6227 1353.8969 1360.8211 1370.5289 1379.3347 1383.8415 1449.7043 1451.4501 1456.5442 1462.0345 1464.1207 1473.0472 1479.7295 1498.7329 1564.9793 1593.9333 1634.1382 2853.1887 2959.1791 2962.0868 2963.1485 2985.5774 2990.3564 3008.4543 3020.5384 3022.1171 3032.3073 3045.9754 3072.9311 3159.0819 3171.8826 3180.7621 3188.0560 3350.7517 3488.6663
redmass: 4.6779 4.4218 3.7710 5.5715 4.5517 3.5387 8.6421 5.0565 7.7250 8.7985 6.6221 5.8923 3.2223 13.5427 8.0217 2.6651 6.0919 3.7993 4.9540 2.1623 1.5418 3.3121 3.4217 7.3592 3.6335 3.0158 4.0749 2.2014 4.1708 1.5920 3.2325 1.7837 2.8010 7.0871 3.9501 8.2033 4.7779 5.2850 4.1587 4.5766 1.5243 2.6430 3.9173 1.7417 1.3914 2.3607 1.5920 2.4172 1.3825 2.7298 3.9444 2.9236 1.3911 4.5087 2.2652 2.5073 2.6864 2.1181 3.1842 2.0391 1.4073 2.0366 1.8100 1.5448 2.0806 1.1375 1.7239 1.4446 1.4730 1.1783 1.2341 1.3988 1.4967 1.5666 1.3727 1.4375 1.3263 1.4378 1.3531 1.3554 4.1912 5.0207 2.0652 1.0940 1.0953 1.0923 1.1211 1.1761 1.1269 1.2210 6.0155 8.1664 8.1464 1.0722 1.0606 1.0625 1.0656 1.0649 1.0676 1.0879 1.0940 1.0981 1.1006 1.1007 1.0976 1.0898 1.0897 1.0966 1.0979 1.0755 1.0785
irintensity: 0.3958 0.2179 0.0845 0.2147 1.2426 0.1975 3.2416 9.7054 3.8684 7.0970 0.9406 1.2768 5.6341 3.6556 2.9147 0.0555 1.9476 3.5166 7.4775 0.7317 4.9878 14.0562 3.1195 36.9662 48.2962 4.8689 38.4896 22.0191 6.9519 6.6367 42.7360 110.1175 112.0728 0.4937 91.0917 26.5498 19.0174 57.6909 66.4279 0.7222 4.1856 7.1821 130.9286 23.8977 41.9394 8.3396 1.2250 16.3531 1.0108 22.3627 33.0674 47.7683 2.4175 37.5812 14.0372 11.4844 31.2270 6.1889 60.0646 128.8240 6.4150 60.9006 29.3359 5.9290 18.2473 9.7868 8.1460 3.7483 3.1250 4.4704 3.1661 7.9353 160.3161 119.2396 1.0849 0.2328 4.0754 0.0621 0.3935 3.2525 20.4680 4.0240 71.6602 14.8050 2.1271 4.9361 5.7102 53.2237 33.0179 82.4097 34.9430 4.3245 173.8512 79.9853 32.5137 31.1442 24.4397 4.3810 22.1235 58.7380 54.4411 55.6414 75.5601 66.0919 20.7151 4.4482 5.1504 1.0126 12.0930 51.7542 27.7493
temp: 298.150 k
press: 1.00000 atm
elementType: 17 16 8 8 8 7 7 7 6 6 6 6 6 6 6 6 6 6 6 6 6 1 1 1 1 1 1 1 1 1 1 1 1 1 1 1 1 1 1
symmnumber: 1
zpe: 789738.2 jmol-1
zpe.correction: 0.300795 hartree
zpe.thermalcorrener: 0.322637 hartree
zpe.thermalcorrenthalpy: 0.323581 hartree
zpe.thermalcorrgfe: 0.245988 hartree
zpe.sumelectzpe: -1752.424368 hartree
zpe.sumelectthermal: -1752.402526 hartree
zpe.sumelectthermalent: -1752.401582 hartree
zpe.sumelectthermalfe: -1752.479175 hartree
dipole: 4.5799 -2.4600 -3.3502
dipole: 6.1848
quadrupole: -117.6515 -153.7048 -137.0221
quadrupole: 5.1721 -0.6804 -4.8089
quadrupole: 18.4746 -17.5787 -0.8959 5.1721 -0.6804 -4.8089
hfenergy: -1752.7251631 hartree
pointgroup: C01 [X(C13H18Cl1N3O3S1)]
dipole: 1.7893717 1.1634229 1.1685033 debye
polarizability: 274.4900047|-25.357032|193.1096273|-5.3837142|-19.546226|171.1232401 unknown
InChI: InChI=1S/C13H18ClN3O3S/c14-11-5-7-12(8-6-11)21(19,20)16-13(18)15-17-9-3-1-2-4-10-17/h5-8,15-16H,1-4,9-10H2
charge 0 multiplicity 1
39 atoms
Cl -6.090248 2.712819 -0.670488
S  -1.870457 -2.037373 0.422359
O  0.111267 -0.047109 -0.966201
O  -1.603424 -2.860645 -0.941162
O  -2.350303 -2.7878 1.785039
N  2.774289 0.416652 -0.026094
N  1.844163 -0.435255 0.593221
N  -0.314703 -1.234698 1.005019
C  5.825897 1.539284 0.679692
C  6.1479 0.351337 -0.258148
C  4.47711 2.258456 0.418794
C  5.069567 -0.756944 -0.31197
C  3.233415 1.481683 0.901855
C  3.729995 -0.272743 -0.934125
C  0.531436 -0.530511 0.118261
C  -3.053922 -0.606846 0.09357
C  -2.946861 0.112297 -1.107539
C  -4.033193 -0.374483 1.072669
C  -3.890189 1.138696 -1.33809
C  -4.971912 0.653858 0.833825
C  -4.880949 1.389805 -0.365724
H  5.835656 1.188676 1.733183
H  6.646424 2.279147 0.592777
H  6.298732 0.734945 -1.288983
H  7.114986 -0.090649 0.05444
H  4.368299 2.519283 -0.651831
H  4.484648 3.218632 0.970181
H  5.454172 -1.591869 -0.930932
H  4.892513 -1.177274 0.700461
H  3.469731 1.051708 1.909002
H  2.386263 2.179493 1.045597
H  3.953589 0.408589 -1.777979
H  3.167777 -1.120866 -1.360635
H  2.123178 -0.968048 1.431409
H  -0.026263 -1.615926 1.914451
H  -2.143267 -0.098014 -1.817934
H  -4.069719 -0.986301 1.979514
H  -3.846641 1.732897 -2.254448
H  -5.756356 0.872297 1.563061
