program: Gaussian 09
title: 000219096
version: EM64L-G09RevD.01
frameworkgroup: C1[X(C20H29NO)]
method: RPBEPBE
basis: SDD
operation: Freq
keyword: #p
keyword: freq=noraman
keyword: PBEPBE/SDD
title: #p freq=noraman PBEPBE/SDD
converged: YES YES NO NO
title: Mulliken charges:
elementType: O N C C C C C C C C C C C C C C C C C C C C H H H H H H H H H H H H H H H H H H H H H H H H H H H H H
charge: -0.438049 -0.079444 0.333073 0.194687 -0.199011 -0.505096 -0.408407 -0.615293 0.337618 -0.154982 -0.368131 -0.473089 -0.807905 -0.787908 0.280091 -0.510940 -0.497476 -0.615252 -0.715941 -0.382597 0.267184 -0.397678 0.212215 0.198732 0.216735 0.233565 0.205261 0.229242 0.237687 0.249412 0.159798 0.208095 0.219663 0.189586 0.207013 0.252597 0.209239 0.208228 0.211954 0.242889 0.239818 0.218720 0.226763 0.235430 0.233596 0.216653 0.239373 0.207465 0.235456 0.249609 0.349751
chargesum: 0.00000
title: Mulliken charges with hydrogens summed into heavy atoms:
elementType: O N C C C C C C C C C C C C C C C C C C C C
charge: -0.088298 -0.079444 0.333073 0.194687 0.013204 -0.089628 0.030419 -0.148365 0.337618 0.094431 -0.000237 -0.063840 -0.139057 -0.124838 0.280091 -0.052402 -0.035282 -0.381657 -0.052450 -0.147141 0.267184 -0.148070
polarizability: 2.49991602e+02 -1.08349278e+01 2.14661588e+02 -1.68567012e+01 -8.80283342e+00 1.89137289e+02
1716.lowfreq: -21.9758 -11.2054 -7.9576 -0.0008 -0.0008 -0.0006 30.9994 52.7527 73.5767
frequency: 30.8088 52.5645 73.5174 87.8139 89.6869 110.4773 141.0450 146.6250 166.6686 184.7710 201.9842 219.5550 233.4707 240.2292 249.4828 278.2328 283.4286 307.5394 320.6889 330.3793 342.5409 344.8554 351.1013 368.4232 382.4948 391.4879 415.5304 442.8574 459.0173 467.2078 478.6414 498.0051 520.9511 546.9765 593.1015 629.7950 657.9967 685.2334 701.5351 726.6544 749.8190 764.1472 778.5242 799.9056 803.0760 817.9294 820.2722 851.3369 856.2597 882.5312 890.2475 907.5193 928.3560 935.7498 939.2391 946.4263 951.7875 959.2696 994.1664 1000.7177 1012.8709 1030.1807 1032.1686 1043.0158 1060.7016 1065.0615 1067.0339 1089.4884 1102.6293 1109.8335 1115.3329 1133.8112 1135.0074 1148.6913 1154.4835 1165.8530 1166.2076 1181.1719 1192.9868 1196.7024 1204.8311 1215.8556 1228.9100 1238.2101 1245.9979 1249.7249 1269.7603 1277.4169 1284.6529 1316.9966 1322.7129 1327.4944 1342.9685 1347.1055 1365.0849 1370.0725 1373.6021 1378.8298 1388.3212 1396.5753 1401.9805 1419.0161 1439.5944 1446.4662 1448.7745 1460.2954 1464.1520 1468.8618 1470.3392 1477.4937 1482.6787 1487.2854 1490.8582 1492.4133 1503.2239 1508.7021 1600.1889 1613.8518 2816.4894 2862.6038 2960.1765 2971.4852 2975.2113 2977.9832 2981.8671 2985.7263 2988.3817 2996.4163 3005.7559 3021.4485 3037.4913 3043.9605 3058.5303 3065.8774 3072.3861 3085.4167 3092.9214 3095.0886 3098.3575 3102.1898 3115.0263 3119.8181 3120.6127 3170.3111 3183.5769 3203.0531 3577.8372
redmass: 4.7235 3.0301 2.8108 3.3864 3.1536 3.0881 1.9680 1.7224 1.4087 1.8289 2.3311 3.2055 3.1915 2.4599 2.2206 3.2450 2.6088 1.9840 2.1713 2.6895 1.6704 1.3817 2.2316 2.1646 2.7607 2.8669 3.2789 2.6992 3.9566 2.9384 4.2745 3.1631 3.2690 2.8568 3.0184 3.3417 4.1220 3.6767 3.6805 3.2948 2.0882 1.5635 1.8135 1.7882 1.6154 1.5790 1.4728 2.0013 1.8168 1.9589 2.4164 2.2183 2.0889 1.8642 1.6999 2.2871 1.4876 2.3778 1.9302 1.8534 1.8059 1.8965 1.3073 1.7465 1.4152 2.4553 1.8865 2.4524 1.7687 1.4834 1.8017 1.8568 1.9668 1.6945 1.5577 2.6505 1.4017 2.3283 2.3047 1.7187 1.6412 1.6079 1.8143 1.5000 1.8459 1.5116 2.5016 1.3527 1.4932 1.5000 1.3725 1.3875 1.5544 1.3574 1.3211 1.5685 1.2035 5.0160 1.2819 1.3916 1.2920 2.9226 1.0883 1.0996 1.1106 1.0517 1.1316 1.0655 1.2722 1.0599 1.0623 1.0866 1.4304 1.1639 1.2679 1.1392 6.6517 6.3439 1.0706 1.0717 1.0644 1.0625 1.0399 1.0502 1.0687 1.0557 1.0432 1.0859 1.0984 1.0947 1.0917 1.0971 1.0967 1.0958 1.0957 1.0515 1.0996 1.0614 1.0980 1.0975 1.0894 1.0911 1.0892 1.0951 1.1165 1.1143 1.0659
irintensity: 0.0240 0.0030 0.6228 0.2249 0.1951 0.3520 0.2522 0.4990 0.5636 0.9901 1.0555 0.1500 1.2250 1.0452 0.1203 0.1297 2.4096 1.1861 0.3200 0.3874 24.1402 106.3331 0.7783 1.1915 2.3464 2.3274 6.7470 8.4091 7.6736 7.8417 5.5397 0.6023 3.7336 1.8682 1.4667 0.9187 0.9604 4.9144 3.5980 3.3264 10.4750 1.5202 2.4195 10.3290 3.2336 14.2164 19.8913 23.5745 23.9026 5.2202 1.6102 3.9946 9.3309 9.7987 4.7396 7.7978 0.9695 8.2858 19.6571 15.3638 2.6140 6.1730 25.9533 35.1528 10.0153 1.2170 1.5224 9.7332 53.5719 33.3391 14.7349 187.1133 8.2699 15.8075 29.2225 18.6556 1.3771 9.9796 14.0679 3.5539 0.7630 12.4867 0.4781 1.2794 2.8725 3.2470 18.0057 8.4791 2.5505 1.5494 18.6367 3.2847 5.1054 3.2162 10.6933 20.1327 16.1259 5.1934 6.5936 34.1089 14.0787 46.4796 10.0928 8.8869 13.6612 5.7561 4.4296 0.6028 5.1870 10.9586 10.5456 7.7200 29.1798 19.2720 35.0679 12.1340 11.2817 64.4335 81.0478 73.9828 11.7092 22.2582 15.8965 15.4208 106.6113 20.7387 46.5837 43.7908 29.6057 16.9624 32.6013 51.2675 12.2580 82.9534 22.3532 25.4208 2.7010 16.8267 22.3801 59.6870 22.9538 9.4190 10.9280 10.2023 0.2568 36.5960 31.0216
temp: 298.150 k
press: 1.00000 atm
elementType: 8 7 6 6 6 6 6 6 6 6 6 6 6 6 6 6 6 6 6 6 6 6 1 1 1 1 1 1 1 1 1 1 1 1 1 1 1 1 1 1 1 1 1 1 1 1 1 1 1 1 1
symmnumber: 1
zpe: 1167203.5 jmol-1
zpe.correction: 0.444564 hartree
zpe.thermalcorrener: 0.466107 hartree
zpe.thermalcorrenthalpy: 0.467051 hartree
zpe.thermalcorrgfe: 0.396243 hartree
zpe.sumelectzpe: -907.767838 hartree
zpe.sumelectthermal: -907.746295 hartree
zpe.sumelectthermalent: -907.745351 hartree
zpe.sumelectthermalfe: -907.816160 hartree
dipole: -0.7564 1.2290 -0.6226
dipole: 1.5717
quadrupole: -136.1207 -139.5721 -127.7670
quadrupole: 6.7490 -7.3306 -2.8864
quadrupole: -1.6341 -5.0855 6.7196 6.7490 -7.3306 -2.8864
hfenergy: -908.2124022 hartree
pointgroup: C01 [X(C20H29N1O1)]
dipole: -0.3122712 0.4687625 -0.2551333 debye
polarizability: 250.4218097|-10.2741374|213.6065319|-16.6353709|-9.8308533|189.7621374 unknown
InChI: InChI=1S/C20H29NO/c1-4-20-9-10-21(13-14-5-6-14)18(19(20,2)3)11-15-7-8-16(22)12-17(15)20/h7-8,12,14,18,22H,4-6,9-11,13H2,1-3H3
charge 0 multiplicity 1
51 atoms
O  4.476137 -2.278418 -0.926263
N  -2.002195 0.30434 0.10958
C  -0.054895 1.825061 0.593304
C  0.76082 1.130095 -0.58382
C  -1.036153 0.74175 1.156241
C  -0.275048 0.587932 -1.643476
C  -1.354431 -0.336479 -1.05588
C  -0.23568 -0.415819 1.825057
C  1.51782 -0.108521 -0.043049
C  -4.358295 -0.421062 -0.324365
C  -3.170882 -0.435316 0.633389
C  1.690661 2.106384 -1.382593
C  -0.884687 3.044563 0.1128
C  0.851132 2.308893 1.763517
C  1.00163 -0.860544 1.052272
C  -5.536008 -1.374232 -0.07342
C  -4.6207 -1.59174 -1.288297
C  2.677041 -0.592627 -0.705487
C  2.935139 2.708725 -0.688033
C  1.665541 -2.048973 1.452316
C  3.320904 -1.777626 -0.289895
C  2.818969 -2.520283 0.800575
H  -1.645616 1.229982 1.944403
H  0.281089 0.037346 -2.427317
H  -0.76256 1.451924 -2.133227
H  -2.127353 -0.527219 -1.821216
H  -0.907904 -1.327607 -0.792145
H  -0.907894 -1.282451 1.984981
H  0.074095 -0.089399 2.838723
H  -4.605367 0.581042 -0.693831
H  -2.933772 -1.504612 0.882601
H  -3.470642 0.052594 1.582578
H  1.06094 2.930295 -1.769718
H  2.026619 1.565614 -2.29116
H  -1.389097 3.506028 0.983884
H  -1.670995 2.748932 -0.599847
H  -0.247655 3.822777 -0.345331
H  0.235456 2.469737 2.670192
H  1.328454 3.272703 1.523002
H  1.648789 1.58843 2.012284
H  -6.550776 -1.004315 -0.24504
H  -5.451065 -2.080754 0.759376
H  -3.929723 -2.440928 -1.255828
H  -5.018419 -1.370875 -2.283359
H  3.084199 -0.041382 -1.561895
H  2.673191 3.5230 0.007348
H  3.493773 1.947393 -0.115723
H  3.621373 3.134752 -1.444359
H  1.260535 -2.620893 2.29681
H  3.32843 -3.437459 1.109439
H  4.749277 -1.684063 -1.668597
