program: Gaussian 09
title: 000219095
version: EM64L-G09RevD.01
frameworkgroup: C1[X(C23H21ClN2O4)]
method: RPBEPBE
basis: SDD
operation: Freq
keyword: #p
keyword: freq=noraman
keyword: PBEPBE/SDD
title: #p freq=noraman PBEPBE/SDD
converged: YES YES NO NO
title: Mulliken charges:
elementType: Cl O O O O N N C C C C C C C C C C C C C C C C C C C C C C C H H H H H H H H H H H H H H H H H H H H H
charge: -0.052053 -0.347456 -0.277776 -0.239732 -0.277350 -0.479583 0.036307 0.128884 0.028386 0.223090 0.252672 0.311998 0.239571 -0.157736 -0.505991 -0.527746 -0.423560 -0.426169 -0.188202 0.202944 0.052553 0.386198 -0.683940 -0.690932 -0.507834 -0.334697 -0.385057 -0.183683 -0.177468 -0.123207 0.316098 0.229258 0.300889 0.253766 0.243272 0.267046 0.231994 0.222940 0.206765 0.253386 0.226238 0.201731 0.235332 0.226374 0.227516 0.197152 0.226366 0.276295 0.267019 0.258703 0.259429
chargesum: 0.00000
title: Mulliken charges with hydrogens summed into heavy atoms:
elementType: Cl O O O O N N C C C C C C C C C C C C C C C C C C C C C C C
charge: -0.052053 -0.347456 -0.277776 -0.239732 -0.277350 -0.163486 0.036307 0.128884 0.028386 0.223090 0.252672 0.311998 0.239571 -0.157736 0.024157 -0.273979 -0.180288 -0.159123 0.043792 0.202944 0.275493 0.386198 0.002448 -0.027495 0.143201 -0.058402 -0.118038 0.075020 0.081961 -0.123207
polarizability: 4.16592767e+02 -5.91315375e+00 3.41757542e+02 4.94783264e+00 -1.18205014e+01 1.77710750e+02
1716.lowfreq: -2.7101 -0.0015 0.0015 0.0015 5.4106 9.3901 13.3134 19.5761 28.0296
frequency: 12.6879 19.4974 27.8935 37.0593 42.9010 48.1030 49.9715 68.7984 92.7526 95.0904 100.5390 114.9096 144.1665 161.4663 164.9419 178.8452 185.8072 210.3646 214.2600 224.5751 239.1780 256.4847 265.0074 290.3404 299.9846 313.7978 328.2090 333.3278 348.6256 355.9471 388.2839 398.7667 414.9418 419.1309 437.9274 455.5972 485.1045 489.8949 512.8461 528.0530 548.8026 556.7299 580.4510 585.0163 613.8720 624.4369 649.1453 654.2263 661.6883 686.1709 701.9745 725.8747 741.8732 749.6184 776.9171 785.0185 791.1028 811.1723 814.5082 817.8961 829.3636 835.7673 872.3638 883.9655 887.6723 904.2729 926.7345 943.3316 943.5610 956.6129 962.1066 982.3665 994.7927 1019.0762 1028.6724 1040.2477 1065.1382 1069.6501 1082.2344 1100.2887 1103.1878 1113.4571 1143.9096 1151.8829 1156.8909 1162.3952 1174.1130 1182.9908 1189.8169 1207.5368 1227.8192 1238.0734 1246.8913 1276.5239 1285.1961 1301.4249 1321.1816 1329.9110 1336.6180 1348.6921 1368.1860 1376.6432 1379.2154 1396.1672 1399.4930 1406.7198 1420.9664 1429.1251 1440.0596 1447.8502 1455.0601 1456.1193 1464.6141 1466.5958 1470.6517 1471.6858 1483.0953 1487.5689 1488.1336 1549.8990 1577.4120 1587.9467 1590.1200 1596.6585 1601.0934 1629.5350 2925.1748 2966.5977 2989.2690 2993.1835 3004.1916 3020.7944 3084.3406 3092.8109 3097.3164 3100.1368 3100.6683 3106.3598 3120.3348 3140.1313 3156.4716 3157.9865 3161.6725 3172.3932 3176.0315 3181.1821 3612.0876
redmass: 6.1501 5.9805 5.3528 3.9718 4.6219 2.9631 3.3755 5.9387 4.9817 7.6171 4.1402 3.5691 4.6759 5.8145 5.0674 5.0982 1.0379 2.6713 4.1566 1.3763 1.5036 6.2302 3.9767 5.7549 5.9490 4.8497 4.5526 4.0130 5.1383 3.3745 4.3856 4.0095 2.9986 6.2019 3.9368 4.3353 3.7658 3.5758 4.3231 1.1555 4.3541 4.5579 5.3089 6.4328 7.1119 7.4457 7.1313 6.0660 6.7410 6.0895 4.2873 3.3242 5.2006 3.0725 3.7672 4.3380 3.2702 6.2701 4.4272 1.4259 1.5831 5.4563 1.4130 5.2971 1.4957 2.7940 1.2288 1.3605 1.3235 1.3380 1.3257 2.6945 4.1460 4.5898 5.3437 5.4429 5.6164 2.5549 1.8905 1.7158 1.2973 1.3415 2.6624 1.4945 2.0661 1.4068 1.2243 1.9639 2.5464 3.1318 1.3690 1.4523 2.1983 2.7257 1.2830 2.7794 2.2289 2.6757 1.4113 3.4545 6.6092 1.4005 1.2594 1.2355 3.7298 5.8985 2.6068 1.3737 2.1463 5.4074 1.0536 1.0537 1.0494 2.3209 1.0817 1.0493 1.0940 1.2785 2.0810 9.0246 7.2561 6.9846 6.7524 9.7046 6.8625 8.3385 1.0343 1.0669 1.0357 1.0358 1.1015 1.0862 1.0990 1.0988 1.0979 1.1006 1.0934 1.1006 1.0920 1.0865 1.0922 1.0893 1.0889 1.0985 1.0971 1.0979 1.0804
irintensity: 0.3145 0.1013 0.8963 1.1375 0.9821 0.4911 2.3070 0.4472 0.8899 1.7820 3.6921 4.1508 1.7493 4.4617 0.7124 1.4631 0.0338 2.4896 1.8568 1.0187 0.8761 2.1119 9.1859 13.6821 3.6850 6.2063 0.9591 0.6571 0.8697 0.8783 8.7156 14.8046 0.5358 3.3212 3.1060 3.7963 12.1365 15.8267 0.7096 90.3842 11.7165 0.3987 4.8966 8.2140 10.1708 3.5032 9.4782 7.3712 4.0404 19.2923 10.1742 25.6494 13.1810 20.3242 13.2880 28.2365 36.6728 3.8119 13.5110 2.0764 65.6002 8.4057 0.5427 8.2645 22.7376 12.8804 2.2928 0.0914 0.1202 1.3307 0.8461 15.8312 51.7648 79.4038 155.9479 30.1394 89.0584 54.5667 103.4998 154.3392 11.5568 8.5757 198.1032 55.9527 10.4150 49.8825 0.4968 19.9542 10.5245 347.6301 46.3805 48.0348 109.1423 106.6030 3.8800 12.4509 29.1018 79.7162 4.2798 73.3311 3.1657 5.4127 33.8178 19.1693 2.2336 0.5658 40.2081 5.1904 51.5262 6.1734 6.8174 11.8206 3.8102 313.6321 9.6703 5.0919 23.9088 20.0724 64.3360 3.7790 61.7516 19.1745 82.1146 105.7817 4.4104 79.7813 80.5759 15.2098 17.5119 35.5942 57.5119 8.7373 6.8855 59.0777 28.4455 19.5189 5.6203 28.8043 22.6880 2.2975 17.9268 3.4277 3.4783 10.3801 2.2887 0.6422 76.6545
temp: 298.150 k
press: 1.00000 atm
elementType: 17 8 8 8 8 7 7 6 6 6 6 6 6 6 6 6 6 6 6 6 6 6 6 6 6 6 6 6 6 6 1 1 1 1 1 1 1 1 1 1 1 1 1 1 1 1 1 1 1 1 1
symmnumber: 1
zpe: 1024356.6 jmol-1
zpe.correction: 0.390157 hartree
zpe.thermalcorrener: 0.418050 hartree
zpe.thermalcorrenthalpy: 0.418995 hartree
zpe.thermalcorrgfe: 0.328671 hartree
zpe.sumelectzpe: -1757.361301 hartree
zpe.sumelectthermal: -1757.333407 hartree
zpe.sumelectthermalent: -1757.332463 hartree
zpe.sumelectthermalfe: -1757.422787 hartree
dipole: 1.7870 3.7451 0.5069
dipole: 4.1804
quadrupole: -184.7380 -146.1683 -184.4929
quadrupole: 10.7398 0.1676 -11.0327
quadrupole: -12.9383 25.6314 -12.6931 10.7398 0.1676 -11.0327
hfenergy: -1757.7514576 hartree
pointgroup: C01 [X(C23H21Cl1N2O4)]
dipole: -0.8162638 1.4231987 -0.1151592 debye
polarizability: 414.9266025|12.1211704|342.3675234|-11.0037134|15.0660427|178.7669335 unknown
InChI: InChI=1S/C23H21ClN2O4/c1-13(2)29-23(27)22-16(12-28-3)20-18(11-25-22)26-17-5-4-6-19(21(17)20)30-15-9-7-14(24)8-10-15/h4-11,13,26H,12H2,1-3H3
charge 0 multiplicity 1
51 atoms
Cl -6.731492 -3.603787 1.09072
O  -2.197227 -0.011766 -0.607783
O  1.402152 -1.612934 -1.474405
O  4.651928 -0.765954 -0.482418
O  3.192125 -1.897712 0.94011
N  0.44605 3.842783 0.239816
N  3.369722 1.536792 0.432022
C  0.533357 1.539144 0.002707
C  -0.86537 1.983981 -0.15571
C  1.298806 2.739209 0.251104
C  -0.864308 3.42163 -0.0024
C  1.258831 0.312097 -0.035619
C  -2.136656 1.385516 -0.38495
C  2.666199 0.383231 0.193612
C  0.654298 -1.042798 -0.329693
C  2.690501 2.70777 0.459711
C  -2.019381 4.227121 -0.078761
C  -3.305323 2.171987 -0.475758
C  -3.244203 3.579006 -0.322207
C  3.491284 -0.879835 0.260408
C  5.610853 -1.930141 -0.432744
C  -3.320458 -0.773459 -0.19476
C  6.466232 -1.808261 0.836546
C  6.407102 -1.841357 -1.736149
C  1.213895 -3.060445 -1.56053
C  -3.972506 -0.558518 1.041785
C  -3.685504 -1.847537 -1.034997
C  -5.016911 -1.423833 1.432368
C  -4.726505 -2.71724 -0.642235
C  -5.380648 -2.489224 0.584297
H  0.733489 4.807993 0.383286
H  0.786909 -1.704324 0.551907
H  -0.411995 -0.960714 -0.582954
H  3.272029 3.616653 0.652592
H  -1.965156 5.313212 0.043758
H  -4.263751 1.686875 -0.681283
H  -4.165888 4.164467 -0.403376
H  4.999645 -2.851652 -0.391982
H  7.205988 -2.629367 0.872933
H  5.836069 -1.869439 1.739325
H  7.008547 -0.846506 0.843228
H  7.126635 -2.678227 -1.797068
H  5.733884 -1.890174 -2.608842
H  6.968144 -0.891625 -1.783035
H  1.788144 -3.392825 -2.440249
H  0.144067 -3.328434 -1.699238
H  1.599267 -3.561156 -0.64775
H  -3.669713 0.265271 1.694657
H  -3.158365 -1.990962 -1.98249
H  -5.530355 -1.274516 2.386428
H  -5.022833 -3.552717 -1.28254
