program: Gaussian 09
title: 000219087
version: EM64L-G09RevD.01
frameworkgroup: C1[X(C16H21IN2O5)]
method: RPBEPBE
basis: SDD
operation: Freq
keyword: #p
keyword: freq=noraman
keyword: PBEPBE/SDD
title: #p freq=noraman PBEPBE/SDD
converged: YES YES NO NO
title: Mulliken charges:
elementType: I O O O O O N N C C C C C C C C C C C C C C C C H H H H H H H H H H H H H H H H H H H H H
charge: 0.058120 -0.247512 -0.410253 -0.408016 -0.224481 -0.228555 -0.154933 -0.485835 0.138207 0.493211 0.356388 -0.486561 -0.593643 -0.476679 0.156200 -0.535703 -0.402423 -0.203733 -0.437824 -0.453356 -0.680132 -0.723098 0.213075 0.206820 0.242008 0.258929 0.234634 0.264013 0.285529 0.189556 0.388215 0.245262 0.253708 0.268215 0.259945 0.280762 0.245463 0.243798 0.216497 0.227742 0.214840 0.219085 0.216053 0.388146 0.388312
chargesum: 0.00000
title: Mulliken charges with hydrogens summed into heavy atoms:
elementType: I O O O O O N N C C C C C C C C C C C C C C C C
charge: 0.058120 -0.247512 -0.022107 -0.019704 -0.224481 -0.228555 -0.154933 -0.097620 0.138207 0.493211 0.356388 0.014377 -0.094996 -0.001594 0.156200 -0.535703 -0.157161 0.041730 0.084100 0.087351 0.007905 -0.073119 0.213075 0.206820
polarizability: 2.85252947e+02 1.95692607e+01 2.50601378e+02 -1.53650891e+01 -4.57390485e+00 1.55523412e+02
1716.lowfreq: -11.5667 -7.2393 -0.0004 0.0004 0.0005 3.4881 16.5641 24.7516 35.8694
frequency: 15.9902 24.5734 35.8549 37.4699 44.5119 46.0075 56.2606 58.8165 62.2289 82.0092 93.7033 99.1737 113.9877 141.2606 149.6112 157.1400 186.2448 196.3286 202.1887 220.2990 250.4654 264.0752 290.3829 302.2943 317.0840 323.8067 330.9156 345.5551 359.9440 376.0352 451.2659 471.6708 476.3809 499.9392 515.8654 524.8957 542.8594 546.9712 589.9527 597.9357 601.5686 624.3268 628.1236 639.2887 641.4122 706.0646 747.3191 754.0862 780.2648 810.4856 825.1230 829.6594 842.0488 850.2051 882.7542 897.7095 936.0920 949.8727 964.5360 973.5942 977.0655 981.5518 1014.2644 1045.6271 1048.0821 1051.3860 1057.4563 1086.7111 1089.5107 1142.8418 1158.5788 1168.0984 1182.6293 1211.7850 1217.4197 1230.2853 1250.6655 1255.0880 1262.1142 1263.6596 1271.5558 1294.0298 1311.9992 1312.4223 1329.9535 1350.4713 1356.4385 1369.6273 1380.0265 1389.2279 1394.4112 1400.6083 1438.5239 1441.0106 1442.8592 1451.8662 1465.5870 1469.1735 1480.1882 1480.4063 1486.5952 1491.5250 1498.1391 1573.1902 1580.3676 1628.7805 1668.9827 1677.3765 2908.3001 2934.2056 2955.0607 2958.6621 2979.2603 2981.1343 3011.5763 3012.8856 3040.3689 3044.3979 3059.5236 3066.1448 3072.9953 3076.0612 3080.1574 3088.8853 3152.3275 3174.1289 3384.4270 3518.8505 3522.7486
redmass: 5.7861 8.2289 7.9045 6.9782 5.9654 8.0346 6.5194 3.9011 6.9331 4.4702 3.6901 4.3602 2.3649 3.4110 4.1881 4.2544 4.0112 3.6228 1.2242 3.0278 2.5762 2.1518 3.0115 3.2734 2.1560 6.2183 4.8016 4.2878 3.6366 2.8377 4.1489 2.2445 2.4796 2.9825 3.3606 3.5854 4.6000 4.4575 3.8865 4.1435 4.5531 2.3889 2.5341 2.2615 1.4980 4.7898 2.7447 1.2627 1.5418 1.1574 1.6583 2.8776 3.6686 3.8351 4.0964 4.4594 4.1541 1.3491 2.2262 2.5107 2.3292 2.4603 1.7646 2.4097 1.9218 2.4641 1.9377 1.8712 1.9194 2.3090 1.7314 1.6295 2.3356 1.6589 2.3595 1.1141 1.4703 1.3521 1.5707 1.1894 2.1063 1.6487 1.4216 2.0167 1.8567 1.6982 3.6544 1.6557 1.6310 1.5011 1.2561 2.1316 1.1577 1.3459 1.7481 1.1345 1.1746 1.2306 1.2389 1.0527 1.2225 1.0514 1.1129 7.0114 5.8627 7.8723 8.4238 8.6584 1.0701 1.0689 1.0679 1.0636 1.0362 1.0348 1.0946 1.0622 1.0886 1.0888 1.0929 1.0985 1.0998 1.0990 1.1001 1.1013 1.0871 1.0966 1.0764 1.0643 1.0643
irintensity: 0.0403 0.4254 0.5808 1.1598 0.9120 0.5940 0.6587 0.2943 1.6630 1.1191 0.6346 1.9286 0.8666 2.0972 8.4834 2.7905 6.1314 0.9903 0.2710 1.1030 2.9519 1.1096 1.5977 10.1600 0.1753 1.2903 6.0978 6.1603 4.3240 0.3101 20.1884 6.3241 40.3142 39.9322 22.8000 24.6402 6.9395 20.6968 9.3428 8.8892 3.5547 35.8366 21.8506 82.8332 127.6923 1.7843 1.9241 96.3116 2.8499 30.3058 36.6855 23.1898 18.1398 4.9629 22.3342 27.8743 15.7305 0.9553 10.4934 69.0955 14.6746 81.1803 8.9268 362.8075 17.0029 233.9555 8.8337 0.3419 2.4178 14.1189 11.5527 12.5133 17.6604 3.9380 8.3695 1.3418 20.2375 2.8583 17.7977 3.1186 13.7805 25.0764 5.0430 17.4287 11.3382 12.9938 3.9300 20.3925 21.3171 5.0614 12.1806 16.3717 28.9839 70.2482 106.2233 7.2023 36.3464 44.8128 147.2658 9.1437 99.1943 10.9594 22.3127 11.0286 35.8729 221.9484 186.3762 300.9889 69.3167 51.3081 51.2525 30.4829 38.6218 26.8480 4.2618 14.3002 3.0285 4.1252 4.3651 1.9769 40.9940 41.0093 37.0543 24.8000 2.8192 12.1905 173.8287 38.4428 38.9932
temp: 298.150 k
press: 1.00000 atm
elementType: 53 8 8 8 8 8 7 7 6 6 6 6 6 6 6 6 6 6 6 6 6 6 6 6 1 1 1 1 1 1 1 1 1 1 1 1 1 1 1 1 1 1 1 1 1
symmnumber: 1
zpe: 923748.9 jmol-1
zpe.correction: 0.351837 hartree
zpe.thermalcorrener: 0.377997 hartree
zpe.thermalcorrenthalpy: 0.378941 hartree
zpe.thermalcorrgfe: 0.291123 hartree
zpe.sumelectzpe: -1117.636196 hartree
zpe.sumelectthermal: -1117.610036 hartree
zpe.sumelectthermalent: -1117.609092 hartree
zpe.sumelectthermalfe: -1117.696911 hartree
dipole: 6.2536 -0.9168 3.2217
dipole: 7.0942
quadrupole: -139.2230 -142.8741 -161.8853
quadrupole: -8.0780 2.9481 11.4525
quadrupole: 8.7712 5.1200 -13.8912 -8.0780 2.9481 11.4525
hfenergy: -1117.9880332 hartree
pointgroup: C01 [X(C16H21I1N2O5)]
dipole: 2.6689713 -0.8157584 -0.0352309 debye
polarizability: 267.9773426|29.6845738|163.2175875|28.7740538|-6.0241617|260.1828069 unknown
InChI: InChI=1S/C16H21IN2O5/c1-3-10-5-6-12(17)11(4-2)16(10)18-13(20)7-19(8-14(21)22)9-15(23)24/h5-6,18,21,23H,3-4,7-9H2,1-2H3
charge 0 multiplicity 1
45 atoms
I  -5.0228 -0.713855 -2.99481
O  -0.468009 2.248525 1.462966
O  3.515948 1.755236 -3.669325
O  2.865303 -2.837431 0.677161
O  1.342528 1.681834 -2.847055
O  1.679597 -2.004989 -1.141397
N  2.3215 0.670054 -0.343457
N  -0.384626 0.462953 -0.081801
C  -1.744803 -0.001461 -0.031597
C  -2.46959 -0.059017 -1.268764
C  -2.312009 -0.426934 1.207716
C  1.636257 1.806688 0.29368
C  -1.806161 0.374024 -2.566959
C  -1.495338 -0.415849 2.493909
C  0.148918 1.524488 0.627398
C  -3.797102 -0.550194 -1.208137
C  -3.650238 -0.885072 1.19342
C  -4.3985 -0.950902 0.001405
C  3.255541 0.947534 -1.431758
C  2.673134 -0.447303 0.529558
C  -1.093311 -0.800527 -3.294425
C  -2.074429 -1.23028 3.668014
C  2.562341 1.486859 -2.682072
C  2.336082 -1.803905 -0.099484
H  2.116637 2.146061 1.236487
H  1.641495 2.666552 -0.399442
H  -2.571848 0.797096 -3.241496
H  -1.070381 1.172258 -2.371043
H  -1.353597 0.637497 2.8050
H  -0.47544 -0.787876 2.260095
H  0.250192 0.082158 -0.801244
H  -4.118956 -1.216833 2.124183
H  4.067082 1.664649 -1.165011
H  3.760863 0.012082 -1.734976
H  3.742241 -0.469032 0.837251
H  2.090013 -0.380401 1.466925
H  -5.428497 -1.316966 0.017651
H  -0.297003 -1.247338 -2.671904
H  -0.627566 -0.436775 -4.22808
H  -1.812809 -1.597662 -3.553945
H  -3.033208 -0.81107 4.024531
H  -1.373764 -1.208738 4.522355
H  -2.244964 -2.288156 3.394337
H  3.06557 2.095387 -4.489238
H  2.608003 -3.718267 0.29088
