program: Gaussian 09
title: 000219083
version: EM64L-G09RevD.01
frameworkgroup: C1[X(C24H27ClN2O3S)]
method: RPBEPBE
basis: SDD
operation: Freq
keyword: #p
keyword: freq=noraman
keyword: PBEPBE/SDD
title: #p freq=noraman PBEPBE/SDD
converged: NO YES NO NO
title: Mulliken charges:
elementType: Cl S O O O N N C C C C C C C C C C C C C C C C C C C C C C C C H H H H H H H H H H H H H H H H H H H H H H H H H H H
charge: -0.067061 0.221828 -0.471959 -0.199373 -0.232731 -0.067315 -0.238299 0.313198 -0.292185 -0.464628 -0.541865 -0.397411 -0.362543 -0.474348 -0.339347 0.189888 -0.322428 -0.418590 -0.518241 0.544191 0.500373 -0.378922 -0.340320 -0.246726 -0.318122 -0.260602 -0.272739 -0.155942 -0.259469 -0.279519 -0.250016 0.264496 0.208306 0.216278 0.262894 0.205042 0.214741 0.205217 0.214613 0.193867 0.259597 0.239901 0.177559 0.212402 0.221192 0.241710 0.354427 0.230325 0.247674 0.245983 0.250276 0.275041 0.242609 0.249146 0.245242 0.228147 0.260719 0.233818
chargesum: 0.00000
title: Mulliken charges with hydrogens summed into heavy atoms:
elementType: Cl S O O O N N C C C C C C C C C C C C C C C C C C C C C C C C
charge: -0.067061 0.221828 -0.117532 -0.199373 -0.232731 -0.067315 -0.238299 0.313198 -0.027689 -0.040043 -0.073928 0.022547 0.045938 0.025150 0.050613 0.189888 0.140474 0.059410 -0.021982 0.544191 0.500373 -0.378922 -0.340320 0.028315 -0.075513 -0.011456 -0.027497 -0.155942 -0.031322 -0.018800 -0.016198
polarizability: 3.65476926e+02 -1.27118130e+01 3.76945252e+02 -3.20518449e+01 1.43303172e+00 1.97206973e+02
1716.lowfreq: -17.8231 -7.2173 -3.9848 0.0003 0.0008 0.0011 1.6356 8.6147 17.9283
frequency: -16.4956 7.1500 17.7966 30.3217 39.0926 58.4981 71.7729 80.5438 94.3899 114.0598 116.7982 130.3381 146.8716 157.9234 176.5164 190.7895 207.3807 221.5160 224.6299 235.7293 245.2239 264.4513 277.8106 281.3484 307.7999 318.1315 346.6763 355.8880 369.9717 384.0851 392.7682 420.6085 424.4642 431.2392 446.6878 465.0626 468.8240 475.5627 479.8305 505.2702 516.9857 519.0556 540.0524 558.0625 576.0887 603.3179 630.9534 640.0277 652.8294 663.7009 682.6484 688.8671 707.0249 719.6772 749.8140 755.2045 761.5119 766.6178 782.6869 797.2121 802.0734 804.7177 834.0668 844.6344 852.2678 875.1093 910.1330 916.8676 922.2889 926.5001 927.8316 941.8797 964.8631 969.7098 984.7180 1004.4390 1012.2753 1014.2936 1023.6191 1035.4283 1037.6096 1046.9994 1061.7092 1067.5413 1086.9111 1090.8143 1094.1045 1099.7744 1106.7510 1120.1973 1125.2770 1130.8478 1142.9204 1150.4310 1164.4754 1167.7251 1177.4012 1178.9329 1187.9716 1201.6200 1236.2220 1240.1916 1247.0338 1248.6811 1254.1058 1276.1661 1282.5283 1283.1277 1287.9454 1294.6872 1305.4991 1320.4058 1322.9811 1336.7722 1339.1581 1344.2559 1352.5205 1365.3128 1368.9861 1372.6861 1378.5941 1382.9274 1400.6192 1403.2249 1428.9267 1438.9216 1457.7077 1459.3468 1460.0290 1463.4330 1467.8430 1478.7428 1481.4993 1483.0368 1492.2258 1504.7764 1555.1788 1580.5269 1582.8806 1611.2920 1676.0112 2815.2273 2865.7796 2892.6660 2973.7180 2989.1948 2991.3387 2996.4112 2997.2813 3014.6285 3020.7126 3021.3642 3024.3254 3047.3580 3053.7457 3060.7409 3065.0132 3075.3944 3095.5535 3113.7978 3134.5797 3143.1130 3147.6956 3166.6731 3183.0741 3185.1839 3193.7076 3516.3129
redmass: 4.4214 8.3116 7.4497 5.5842 7.1730 5.0795 4.6613 5.9993 4.4213 4.5064 4.3189 5.0510 3.7694 7.9399 3.1436 3.5902 2.6182 4.1863 2.6147 4.5593 3.9510 4.7174 6.5657 6.0098 3.8699 5.2060 3.5971 2.9202 6.1861 2.5661 2.5254 5.2004 3.0225 3.8981 3.1137 3.7273 1.9223 3.8228 2.8146 2.0511 5.4170 3.7522 4.1524 3.6958 5.0175 5.6827 3.0689 5.2857 5.5311 6.2746 3.3827 5.2043 3.7854 2.9651 1.4118 3.9657 3.3016 1.3204 4.1466 1.3361 3.3918 1.5973 1.5577 1.3891 1.6815 2.0716 2.8728 3.0546 2.3802 1.4376 1.3569 2.5035 2.2997 1.3155 2.5922 4.0414 1.8417 2.1041 6.7018 2.5710 5.2347 2.3613 2.2549 2.6649 3.0301 3.2271 2.4592 2.1287 2.2940 2.5573 1.7216 2.0717 1.4465 1.8703 1.7784 2.1647 1.0857 1.1380 1.3239 1.3304 1.4770 1.5037 1.7380 1.7207 1.3200 1.3219 1.4751 1.3805 1.4738 1.2269 1.3981 1.3413 1.3981 1.7837 1.4002 1.3263 1.4632 1.7763 1.8966 2.6098 1.5715 4.2559 1.4285 3.4011 2.3381 1.0916 1.0936 1.1776 2.2479 1.0913 1.0839 2.0131 1.2283 1.0901 1.1123 1.0923 6.4112 6.7494 7.4433 7.5353 12.2252 1.0706 1.0709 1.0687 1.0812 1.0841 1.0622 1.0622 1.0619 1.0602 1.0594 1.0660 1.0882 1.1002 1.0884 1.1004 1.1014 1.1034 1.1024 1.1065 1.0857 1.0911 1.0899 1.0968 1.0954 1.0957 1.0913 1.0655
irintensity: 1.9914 0.1558 0.0548 0.7068 0.7481 3.0791 1.2795 1.2689 0.6152 5.3010 1.0117 0.2113 1.1553 0.6680 0.1825 0.1899 4.5631 1.3352 1.4400 0.2181 1.9799 3.9766 1.3362 6.0438 2.6982 2.4215 1.3469 6.6984 3.0814 0.7513 1.2074 1.6315 7.6906 4.0716 0.2022 3.3268 113.5926 13.4401 19.3293 70.2685 12.9595 32.8067 1.3160 11.4067 7.3300 0.3685 4.5685 16.2804 3.7608 4.3549 4.7689 1.9532 1.4269 6.1081 78.2717 8.0502 5.7230 23.0562 11.4384 34.1411 13.3979 1.8777 24.9766 1.5491 48.9409 20.7180 10.0133 8.0917 53.7470 9.1124 1.9664 26.4044 36.6770 0.0239 11.6169 7.5773 0.1314 22.3106 48.5120 3.9567 1.2297 15.0627 36.8544 10.1481 200.1703 2.2198 45.2011 69.1510 9.6657 9.7496 36.2098 32.8174 9.9216 5.1495 4.3957 6.6596 2.4479 15.6699 34.3352 37.2538 27.9112 2.2391 67.6049 22.6883 6.9041 23.9069 20.0216 3.6714 15.5500 9.9224 24.9863 4.4535 3.6233 54.7901 13.6832 23.2859 15.5470 10.2902 31.4372 1.4055 4.1875 25.2219 9.2845 49.1538 11.3015 7.0588 7.8845 53.4431 342.4120 8.0561 9.0979 18.5864 6.1256 2.3528 10.9073 23.7318 44.8669 0.6056 68.5085 54.1044 234.5513 95.1590 56.1832 71.2168 5.1852 15.6007 7.9922 35.0813 23.7174 25.3838 15.6568 41.9129 59.0209 1.5333 38.5072 8.4990 32.5868 35.5697 13.2638 23.4065 0.3605 10.2135 3.7222 28.5580 12.2734 1.6915 0.6147 9.6754
temp: 298.150 k
press: 1.00000 atm
elementType: 17 16 8 8 8 7 7 6 6 6 6 6 6 6 6 6 6 6 6 6 6 6 6 6 6 6 6 6 6 6 6 1 1 1 1 1 1 1 1 1 1 1 1 1 1 1 1 1 1 1 1 1 1 1 1 1 1 1
symmnumber: 1
zpe: 1222317.3 jmol-1
zpe.correction: 0.465556 hartree
zpe.thermalcorrener: 0.492883 hartree
zpe.thermalcorrenthalpy: 0.493828 hartree
zpe.thermalcorrgfe: 0.405766 hartree
zpe.sumelectzpe: -2121.755655 hartree
zpe.sumelectthermal: -2121.728328 hartree
zpe.sumelectthermalent: -2121.727383 hartree
zpe.sumelectthermalfe: -2121.815445 hartree
dipole: -1.9215 -5.4886 2.5415
dipole: 6.3464
quadrupole: -188.7052 -194.5503 -205.6031
quadrupole: 24.3821 -22.8330 2.1282
quadrupole: 7.5810 1.7359 -9.3169 24.3821 -22.8330 2.1282
hfenergy: -2122.2212109 hartree
pointgroup: C01 [X(C24H27Cl1N2O3S1)]
dipole: 0.6958329 -2.3182031 -0.6131967 debye
polarizability: 365.8918823|7.1688447|370.7727343|-34.4798585|-30.8968238|202.9645347 unknown
InChI: InChI=1S/C24H27ClN2O3S/c25-17-6-7-22-20(16-17)27(19-4-1-2-5-21(19)31-22)12-3-11-26-13-9-24(29,10-14-26)18-8-15-30-23(18)28/h1-2,4-7,16,18,29H,3,8-15H2
charge 0 multiplicity 1
58 atoms
Cl -1.950208 4.642493 -1.026616
S  -6.314248 0.085952 0.214377
O  4.836408 1.088517 -0.984331
O  7.91342 0.35438 1.27598
O  5.965658 1.468084 1.844124
N  1.735413 -0.71425 -0.981698
N  -3.333581 -0.406561 -0.620594
C  4.568495 -0.179602 -0.267264
C  5.87073 -0.637471 0.4626
C  4.159172 -1.188319 -1.362718
C  3.396353 -0.007727 0.734634
C  2.811447 -0.813271 -2.005872
C  2.07678 0.331914 0.019612
C  7.040475 -1.095731 -0.441865
C  0.413754 -0.494871 -1.615995
C  6.516137 0.503954 1.278042
C  8.279099 -0.838484 0.441488
C  -0.766851 -0.621708 -0.629664
C  -2.112073 -0.704555 -1.405479
C  -3.699786 0.958578 -0.448991
C  -3.939519 -1.463648 0.129089
C  -4.994592 1.337666 0.015559
C  -5.262996 -1.353004 0.64375
C  -2.781404 2.004897 -0.753856
C  -3.24441 -2.679871 0.380531
C  -5.332904 2.689697 0.211735
C  -5.845363 -2.386181 1.403116
C  -3.16461 3.348105 -0.593014
C  -3.844102 -3.733097 1.104449
C  -4.422772 3.726539 -0.101225
C  -5.144408 -3.592023 1.631137
H  5.608173 -1.44448 1.178467
H  4.081553 -2.195317 -0.909556
H  4.93664 -1.216681 -2.147521
H  3.645535 0.779936 1.469017
H  3.262152 -0.956755 1.288984
H  2.934905 0.148707 -2.560459
H  2.524519 -1.593002 -2.736517
H  1.27158 0.389836 0.772171
H  2.161201 1.337613 -0.465541
H  7.071158 -0.455643 -1.341676
H  6.96471 -2.149488 -0.75402
H  0.359846 0.504332 -2.128188
H  0.299796 -1.262141 -2.408622
H  8.495914 -1.673932 1.131453
H  9.188763 -0.562042 -0.112283
H  4.935049 1.808361 -0.305758
H  -0.60664 -1.520637 -0.007881
H  -0.795494 0.23812 0.063004
H  -2.088058 0.003635 -2.255243
H  -2.229767 -1.710599 -1.846626
H  -1.774706 1.788424 -1.112106
H  -2.222622 -2.81294 0.020189
H  -6.329826 2.942043 0.587601
H  -6.858771 -2.251869 1.796658
H  -3.279692 -4.657837 1.265767
H  -4.693204 4.776903 0.028063
H  -5.609623 -4.398848 2.205783
