program: Gaussian 09
title: 000019318
version: EM64L-G09RevD.01
frameworkgroup: C1[X(C8H10N2O2)]
method: RPBEPBE
basis: SDD
operation: Freq
keyword: #p
keyword: freq=noraman
keyword: PBEPBE/SDD
title: #p freq=noraman PBEPBE/SDD
converged: NO YES NO NO
title: Mulliken charges:
elementType: O O N N C C C C C C C C H H H H H H H H H H
charge: -0.235187 -0.236162 -0.406340 0.016454 0.481099 -0.324013 -0.335087 -0.389506 0.382542 -0.371234 -0.347693 -0.721285 0.225941 0.225726 0.307259 0.249029 0.225646 0.281646 0.283198 0.226078 0.225124 0.236767
chargesum: 0.00000
title: Mulliken charges with hydrogens summed into heavy atoms:
elementType: O O N N C C C C C C C C
charge: -0.235187 -0.236162 -0.099080 0.016454 0.481099 0.127654 -0.086058 -0.163861 0.382542 -0.089588 -0.064495 -0.033317
polarizability: 2.13641139e+02 -2.24716831e+00 1.10463661e+02 1.52671205e-01 9.64483252e-03 5.23163530e+01
1716.lowfreq: -18.2613 -7.3536 -6.0836 -0.0011 -0.0011 -0.0010 40.2517 70.1201 96.0524
frequency: 40.2291 70.0403 95.9769 114.2649 134.7343 232.6827 253.6997 275.9627 291.1082 388.0812 412.2969 434.4610 463.7865 497.4228 517.7049 624.7736 641.2825 664.7054 730.5088 767.4712 804.0189 820.1017 823.7990 839.3174 932.2165 976.4499 982.5810 989.9670 1069.4242 1098.2985 1110.0286 1143.5685 1159.2890 1179.7443 1236.7821 1266.7906 1285.8096 1309.6246 1346.0844 1361.2251 1388.6582 1398.8782 1452.2590 1476.1539 1478.5681 1484.6385 1498.7677 1521.2079 1584.7634 1629.0040 2951.2928 2988.6763 2992.7384 3082.8681 3099.7574 3128.1430 3162.8961 3181.7913 3184.6247 3556.8371
redmass: 3.4200 4.4271 2.9570 4.1863 3.2846 5.8045 1.2530 4.9805 4.1790 3.8097 1.8231 1.5204 6.1637 2.9031 6.1507 6.9290 7.1895 4.5745 4.5973 7.2468 1.1696 1.2297 4.1975 1.7093 2.0634 1.3194 1.3386 2.9724 2.7151 3.0275 1.4202 1.4951 2.2730 1.4389 4.4607 1.1093 1.4217 1.5985 6.7173 1.5547 3.6787 1.2372 4.3269 1.4004 1.0402 1.3427 1.0890 3.2716 5.6559 6.5077 1.0578 1.0366 1.1044 1.1010 1.0986 1.0902 1.0877 1.0947 1.0963 1.0771
irintensity: 0.6221 0.1223 0.8041 0.9498 3.3737 0.9028 2.1467 0.3079 0.6663 0.8601 45.7703 59.2846 0.8944 3.6166 2.4537 1.1935 17.9758 24.0816 3.5216 0.9241 6.8590 18.7665 7.2628 63.2864 1.3074 3.6273 0.1812 0.2513 1.0734 9.0565 15.7715 2.0710 42.2471 277.9243 520.9268 0.0171 18.2037 24.0303 96.6376 11.3827 117.4469 25.7164 1.8892 21.0262 14.4973 15.1607 41.1792 112.0872 14.8785 405.6645 47.9858 29.0066 29.0392 41.2836 27.2420 13.5245 6.5878 1.0148 7.9731 70.7884
temp: 298.150 k
press: 1.00000 atm
elementType: 8 8 7 7 6 6 6 6 6 6 6 6 1 1 1 1 1 1 1 1 1 1
symmnumber: 1
zpe: 452360.9 jmol-1
zpe.correction: 0.172295 hartree
zpe.thermalcorrener: 0.183673 hartree
zpe.thermalcorrenthalpy: 0.184617 hartree
zpe.thermalcorrgfe: 0.134217 hartree
zpe.sumelectzpe: -569.837410 hartree
zpe.sumelectthermal: -569.826033 hartree
zpe.sumelectthermalent: -569.825089 hartree
zpe.sumelectthermalfe: -569.875489 hartree
dipole: -9.6522 0.8707 -0.0166
dipole: 9.6914
quadrupole: -81.1044 -65.3314 -72.8497
quadrupole: 0.9402 0.0218 -0.0177
quadrupole: -8.0092 7.7637 0.2455 0.9402 0.0218 -0.0177
hfenergy: -570.0097057 hartree
pointgroup: C01 [X(C8H10N2O2)]
dipole: -3.7993423 -0.3212249 0.0023559 debye
dipolederiv: -0.8333822 -0.2172746 -0.0002639 -0.5690875 -0.7554303 -0.0006498 -0.0012862 -0.0011885 -0.2529635 -0.9783008 0.2091437 0.0006193 0.5195337 -0.6480073 -0.0010084 0.0007643 -0.0006076 -0.2540035 -2.0070626 0.0739285 -0.0007216 -0.2031989 -0.2205698 -0.0030316 -0.0121089 -0.0026779 -0.4528831 2.4536771 0.0710881 -0.0003378 0.141807 1.0844564 0.0015851 0.0000893 0.0018088 0.1879381 1.8756229 0.0574181 0.0005271 0.355642 0.0804241 0.0007273 0.0013815 0.0005413 0.1638483 0.6573628 -0.1754498 -0.0021786 -0.5733696 0.380385 0.0023268 0.0008682 0.0026581 0.3509083 -0.6350978 -0.0134609 -0.0006207 -0.6476705 -0.0258082 0.0011148 0.0001491 0.0005538 -0.2361205 -0.72344 -0.0154533 -0.0000409 0.4783937 0.0715299 0.0005015 0.0008791 0.0005126 -0.2204265 -1.3417926 -0.0459077 -0.0000137 -0.0898914 -0.1846977 -0.0002483 0.0006135 -0.000578 0.0036898 0.656712 -0.0714393 -0.0001 -0.2671407 0.0558515 0.0001966 -0.0009849 0.0003698 -0.0843025 0.5295748 0.107828 0.0001035 0.3776519 0.1088308 0.000381 0.0006316 0.0005507 -0.084724 -0.0936712 0.0070615 -0.0015238 0.089081 0.0460941 -0.0013533 -0.0008407 -0.0020039 0.0871694 -0.0380916 -0.0361948 -0.0561443 0.1320514 -0.0452895 -0.094705 0.0249182 -0.116262 -0.0813645 -0.0346933 -0.0402484 0.0577676 0.1256432 -0.0477817 0.0946264 -0.0210207 0.114499 -0.0744097 0.1829177 0.0150177 0.0005473 0.1325486 0.0967421 0.0006573 0.0041987 0.0018292 0.306638 0.0069244 0.0901704 0.0005806 0.0963756 -0.0142422 -0.0006692 0.0006729 -0.0004661 0.1645619 0.0078473 -0.1008754 -0.000146 -0.0729608 -0.0613042 -0.0004965 -0.0002614 -0.000465 0.1626258 0.101172 -0.0570265 -0.0001276 -0.0123364 0.0374478 -0.0003228 -0.0002961 -0.0002777 0.1652997 0.0846314 0.0732169 0.0001918 0.0185489 0.0554559 -0.0002628 0.0001713 -0.0002119 0.1666094 0.0941541 -0.0094743 0.0007829 -0.0904762 0.0135405 -0.1155156 -0.0439682 -0.1149337 -0.0707486 0.0924142 -0.0110602 0.0011898 -0.093638 0.0078593 0.1166263 0.0445925 0.117162 -0.0656616 -0.0574785 0.0889921 -0.0000909 0.1524928 -0.0354863 -0.0004801 0.000837 -0.0008131 0.1183193 unknown
polarizability: 213.6632714|1.6675203|110.4414009|0.0017354|0.1264958|52.3164815 unknown
InChI: InChI=1S/C8H10N2O2/c1-2-9-7-3-5-8(6-4-7)10(11)12/h3-6,9H,2H2,1H3
charge 0 multiplicity 1
22 atoms
O  3.529062 1.340853 0.003555
O  3.755249 -0.933552 -0.000782
N  -2.615658 -0.447722 0.000988
N  3.030208 0.142895 0.000796
C  -1.241274 -0.286134 0.001795
C  -3.587308 0.655288 0.003819
C  -0.638933 1.013463 0.004781
C  -0.387759 -1.438335 -0.000844
C  1.574557 -0.003412 0.001219
C  0.755738 1.1503 0.004269
C  1.003036 -1.301355 -0.001099
C  -5.024254 0.109606 -0.015745
H  -3.438544 1.287516 0.903817
H  -3.421237 1.304768 -0.880406
H  -2.986888 -1.398456 0.00497
H  -1.264642 1.909906 0.008202
H  -0.835618 -2.439377 -0.003028
H  1.230002 2.135446 0.00655
H  1.663511 -2.172332 -0.003236
H  -5.209253 -0.495904 -0.921685
H  -5.226618 -0.515617 0.873102
H  -5.747976 0.941955 -0.013137
