program: Gaussian 09
title: 000219068
version: EM64L-G09RevD.01
frameworkgroup: C1[X(C15H13FO2)]
method: RPBEPBE
basis: SDD
operation: Freq
keyword: #p
keyword: freq=noraman
keyword: PBEPBE/SDD
title: #p freq=noraman PBEPBE/SDD
converged: YES YES NO NO
title: Mulliken charges:
elementType: F O O C C C C C C C C C C C C C C C H H H H H H H H H H H H H
charge: -0.209430 -0.406932 -0.237933 -0.327887 0.506290 0.347752 -0.388032 -0.458567 -0.399524 -0.385700 -0.694944 0.382814 0.178938 -0.540324 -0.414847 0.329693 -0.192983 -0.389816 0.248917 0.262122 0.235718 0.239566 0.240668 0.230594 0.242182 0.224096 0.266821 0.243421 0.232145 0.258567 0.376615
chargesum: 0.00000
title: Mulliken charges with hydrogens summed into heavy atoms:
elementType: F O O C C C C C C C C C C C C C C C
charge: -0.209430 -0.030317 -0.237933 -0.078970 0.506290 0.347752 -0.125911 -0.222849 -0.159958 -0.145032 0.001928 0.382814 0.178938 -0.273503 -0.171426 0.329693 0.039162 -0.131250
polarizability: 2.69755355e+02 4.63250995e+00 1.55033581e+02 6.56016743e+00 1.27933650e+01 1.00350999e+02
1716.lowfreq: -3.4396 0.0005 0.0007 0.0008 3.7659 13.9189 24.6257 35.4058 48.8222
frequency: 24.4950 35.3828 48.8117 65.1129 83.4785 107.0963 154.0358 197.6661 209.3173 229.3659 238.9554 279.6568 299.3947 345.0395 365.2544 408.4787 427.1702 455.2054 463.9793 506.3371 524.5053 565.8367 602.2127 604.1907 629.5077 637.7085 676.1911 695.1820 722.8130 748.3590 781.1787 793.2076 823.8193 844.4841 852.0179 860.6225 884.4169 895.4291 961.6376 972.3282 976.2805 986.9251 993.1803 1010.1441 1034.6787 1039.1282 1071.0741 1084.1050 1094.7414 1131.2768 1154.2180 1180.6086 1196.2365 1210.8235 1237.7572 1274.7656 1279.8674 1300.2445 1317.5408 1343.3899 1371.8155 1378.8581 1391.3648 1414.5254 1437.4297 1468.3833 1472.3403 1474.8580 1515.3422 1570.4296 1589.5113 1618.4064 1621.0689 1658.8481 2994.2088 3047.2402 3091.9464 3106.5524 3123.1150 3128.6620 3139.4645 3145.7427 3151.9549 3159.3184 3167.0196 3181.2436 3503.5953
redmass: 6.0360 6.8210 6.5790 4.3247 5.3052 6.1037 4.7952 2.8405 1.1727 5.1289 3.9311 5.0781 6.3520 4.8751 5.4791 2.8812 4.5984 3.4309 4.2660 7.4348 3.4323 3.3485 2.9800 3.3630 1.9531 6.3419 3.4743 2.1909 5.2927 3.6165 2.4453 1.7055 2.8185 1.6588 1.4532 3.4299 1.6274 1.4090 1.3870 1.3519 1.4431 4.8430 2.0911 3.3020 2.4955 2.2737 1.5573 1.5394 2.2948 1.4904 2.0085 1.2356 1.4945 1.4519 1.6138 1.5452 1.5982 2.2587 1.4652 1.9684 2.8121 6.3964 1.1973 3.5018 3.1270 1.2643 1.7066 1.0621 2.8578 6.0530 6.9084 6.5242 6.6767 8.1589 1.0352 1.0852 1.1002 1.1005 1.0874 1.0874 1.0871 1.0956 1.0967 1.0937 1.0923 1.0977 1.0638
irintensity: 0.5747 2.0316 1.2989 0.1715 0.3133 0.3948 0.2488 0.1562 0.4648 0.0889 1.9057 0.8787 1.3474 1.6408 4.9684 0.5953 3.8410 13.4010 4.7434 5.2407 3.0141 39.5724 38.0457 18.8416 69.9304 3.8044 37.5635 18.0300 38.2415 8.4873 28.6408 38.4212 4.0206 41.1239 19.2498 38.5573 14.3536 2.0489 0.1205 0.7835 1.5255 0.3308 5.6841 10.3964 277.7353 10.3320 22.9178 6.2894 45.2317 19.6317 38.2338 6.6116 1.1487 1.0648 0.8144 6.3126 13.2171 1.3100 4.3351 39.1912 10.7683 3.3817 20.6087 12.0895 13.9169 19.1328 64.5432 16.2284 16.3194 17.0797 49.5996 48.0802 18.9127 187.1608 28.3598 6.7461 38.6088 16.4176 12.5700 10.4287 7.9796 17.5418 0.1693 15.1822 0.3283 4.9925 23.4007
temp: 298.150 k
press: 1.00000 atm
elementType: 9 8 8 6 6 6 6 6 6 6 6 6 6 6 6 6 6 6 1 1 1 1 1 1 1 1 1 1 1 1 1
symmnumber: 1
zpe: 627202.8 jmol-1
zpe.correction: 0.238889 hartree
zpe.thermalcorrener: 0.254849 hartree
zpe.thermalcorrenthalpy: 0.255793 hartree
zpe.thermalcorrgfe: 0.193627 hartree
zpe.sumelectzpe: -828.432241 hartree
zpe.sumelectthermal: -828.416282 hartree
zpe.sumelectthermalent: -828.415338 hartree
zpe.sumelectthermalfe: -828.477503 hartree
dipole: 1.1346 -0.6299 0.9414
dipole: 1.6032
quadrupole: -104.8080 -100.8251 -103.8900
quadrupole: 16.4755 2.5685 -0.4160
quadrupole: -1.6336 2.3493 -0.7156 16.4755 2.5685 -0.4160
hfenergy: -828.6711303 hartree
pointgroup: C01 [X(C15H13F1O2)]
dipole: 0.436588 0.2697808 -0.36669 debye
polarizability: 269.8496676|-0.8828625|154.2504613|-7.8984834|13.8310643|101.0398056 unknown
InChI: InChI=1S/C15H13FO2/c1-10(15(17)18)11-5-7-12(8-6-11)13-3-2-4-14(16)9-13/h2-10,17H,1H3
charge 0 multiplicity 1
31 atoms
F  -5.045582 -2.014653 0.245691
O  4.767116 -1.456806 1.031632
O  4.691898 0.831453 1.412561
C  3.750634 -0.095839 -0.692303
C  2.229334 -0.02261 -0.48989
C  -0.618297 0.140536 -0.18582
C  1.639677 1.028117 0.25895
C  1.380647 -0.992333 -1.076184
C  0.241399 1.105793 0.40793
C  -0.019511 -0.911375 -0.92982
C  4.282688 1.106023 -1.514981
C  -2.098317 0.229087 -0.028826
C  4.44089 -0.143277 0.669901
C  -2.891148 -0.949523 0.032805
C  -2.753358 1.489576 0.06185
C  -4.280612 -0.830661 0.178004
C  -4.154372 1.572467 0.21009
C  -4.946531 0.402935 0.270633
H  3.987949 -1.039902 -1.211918
H  2.280186 1.772694 0.74568
H  1.81673 -1.812901 -1.658304
H  -0.187364 1.90732 1.01986
H  -0.653453 -1.657106 -1.422782
H  3.764382 1.153538 -2.487955
H  4.109443 2.052918 -0.976704
H  5.367979 1.010914 -1.698171
H  -2.437758 -1.944754 0.004016
H  -2.165342 2.409916 -0.015306
H  -4.638062 2.553072 0.269244
H  -6.033435 0.438898 0.384638
H  5.174392 -1.45692 1.940983
