program: Gaussian 09
title: 000219067
version: EM64L-G09RevD.01
frameworkgroup: C1[X(C20H24FN3O2)]
method: RPBEPBE
basis: SDD
operation: Freq
keyword: #p
keyword: freq=noraman
keyword: PBEPBE/SDD
title: #p freq=noraman PBEPBE/SDD
converged: YES YES NO NO
title: Mulliken charges:
elementType: F O O N N N C C C C C C C C C C C C C C C C C C C C H H H H H H H H H H H H H H H H H H H H H H H H
charge: -0.207663 -0.247400 -0.445116 -0.084413 -0.162474 -0.078997 -0.380132 -0.525208 -0.383556 -0.351529 0.317832 -0.403782 -0.520265 0.353116 0.145231 0.025470 0.304238 -0.359432 -0.373763 -0.405778 -0.372880 -0.785757 -0.383011 -0.385769 -0.302980 0.318500 0.220033 0.185404 0.200962 0.240268 0.223541 0.190503 0.188344 0.241243 0.221740 0.256038 0.239059 0.243962 0.226281 0.271694 0.218405 0.258809 0.240558 0.238345 0.315212 0.253461 0.252729 0.191025 0.214654 0.363249
chargesum: 0.00000
title: Mulliken charges with hydrogens summed into heavy atoms:
elementType: F O O N N N C C C C C C C C C C C C C C C C C C C C
charge: -0.207663 -0.247400 -0.081868 -0.084413 -0.162474 -0.078997 0.025305 -0.083979 0.030489 0.078059 0.317832 -0.182041 -0.025169 0.353116 0.145231 0.025470 0.304238 -0.115470 -0.147482 -0.134084 0.104334 0.008358 -0.129550 -0.133039 0.102699 0.318500
polarizability: 3.78062581e+02 8.10638985e-01 2.41094382e+02 -1.57192486e+01 5.95318996e+00 1.41096539e+02
1716.lowfreq: -11.7323 -3.8157 0.0007 0.0009 0.0013 0.9139 10.8799 16.0098 21.8673
frequency: 8.6326 15.6634 21.8381 33.8452 39.9764 50.1674 65.6602 77.7359 93.7043 106.4934 115.8744 128.5306 137.8147 143.7790 181.7956 204.8076 216.9047 223.9452 243.6718 260.1217 267.7820 290.5358 308.3496 329.3492 343.5857 367.2857 392.2190 408.4958 412.7977 425.2382 472.3109 477.7467 496.2830 509.4961 541.1462 542.4503 559.9887 617.3629 629.9071 633.6898 649.3710 687.0248 698.5894 709.6591 716.6691 727.0952 766.2882 793.8396 797.0130 807.4842 812.2807 822.7671 846.0844 859.8565 860.2309 923.0586 927.9893 933.7859 941.9109 954.3285 956.8222 960.6974 982.6497 990.9929 1003.7035 1021.5453 1041.2864 1049.0750 1051.6649 1066.8175 1076.3199 1087.2034 1089.2534 1107.8910 1133.8797 1153.4433 1156.6563 1162.3050 1191.4084 1192.7117 1196.1757 1205.7837 1211.1552 1229.8024 1236.7673 1259.7108 1263.1033 1265.0442 1292.2061 1294.0693 1303.2975 1311.1517 1335.2857 1343.1146 1350.5516 1352.0797 1359.5491 1368.2859 1375.5541 1395.0458 1399.6377 1405.3056 1408.1536 1427.7376 1435.7785 1442.7805 1451.3456 1454.2872 1459.1355 1464.5030 1465.4580 1477.1658 1480.2700 1492.0799 1495.1214 1539.0959 1577.5612 1589.9302 1608.6928 1664.3977 2786.0635 2845.3304 2865.8193 2950.8741 2971.6953 2978.1949 2978.9932 2980.8384 3005.8067 3023.9347 3030.9999 3038.2703 3054.3095 3056.6851 3068.2098 3078.4525 3115.9506 3116.6362 3146.6574 3149.2326 3172.8298 3176.3945 3224.8317 3324.1495
redmass: 4.2246 5.3127 4.8396 4.9215 5.1824 4.1783 4.6105 6.4946 2.8828 2.6908 1.0350 5.6692 4.9441 3.5009 3.9152 3.9911 2.0295 4.4466 3.6503 4.1062 3.8233 5.6655 4.1846 2.5988 2.0885 5.1397 4.0909 4.2402 3.0090 3.6230 3.0000 3.3547 4.8895 3.3520 2.8321 2.9859 3.1066 5.1414 6.9789 5.0181 3.6811 2.9740 1.7239 2.0511 3.3032 4.2928 2.4061 2.3510 2.6363 1.7564 1.3410 1.7608 1.5656 2.5389 1.4515 2.4051 2.7538 2.5897 1.5649 1.4660 2.4985 2.7888 2.1001 2.2052 2.6185 3.3129 1.8450 1.7335 1.8574 1.9890 2.2841 2.5567 2.2948 1.3708 2.0919 2.0254 1.5924 2.0730 1.4830 1.1986 1.6280 1.5343 1.6250 1.3330 2.1984 1.4008 2.7922 1.7287 1.4744 1.3366 1.3549 1.5155 1.4281 1.3085 1.8931 2.4208 2.0835 1.6199 3.6417 1.8128 1.5805 1.6757 3.1623 1.2256 1.1534 1.0933 1.0816 1.5999 1.0870 1.1239 1.1224 2.3548 1.1280 1.0607 2.6519 4.8902 8.0138 7.4530 6.4274 6.9232 1.0715 1.0714 1.0710 1.0690 1.0630 1.0391 1.0792 1.0605 1.0604 1.0960 1.0967 1.0911 1.0974 1.0898 1.0951 1.1014 1.0906 1.0971 1.0885 1.0878 1.0960 1.0969 1.0975 1.0657
irintensity: 0.1468 0.0845 0.0965 0.1733 5.0595 0.6222 1.8201 0.2622 2.6922 1.7102 0.2318 0.9876 3.9213 0.1464 6.9442 2.3425 3.3071 6.0873 2.5675 1.3254 3.3839 14.8477 1.7003 8.5539 4.7481 3.2083 2.3888 1.4223 0.1485 3.0259 5.0925 1.4483 4.7171 15.3986 1.5790 2.9815 2.9083 11.7692 0.2982 16.0011 7.1808 0.5910 87.4258 56.7684 1.4189 22.9337 20.1372 7.8253 29.4291 16.5667 9.6448 65.7228 27.7261 10.2429 12.1949 4.7602 68.3777 9.2533 0.0947 5.4523 67.6614 8.4326 18.7020 4.9688 5.8155 50.2799 8.5119 3.5633 7.9451 38.1107 1.7778 0.9717 8.7549 14.9025 74.3398 7.4538 58.7832 17.8689 39.2638 21.3554 11.0410 15.4815 23.2713 9.5044 33.9837 55.2506 1.7734 19.2745 7.2540 19.2530 26.3853 21.5818 19.5426 9.3977 17.6948 6.6273 16.2602 67.5733 7.0845 37.0612 10.9825 42.8963 2.9249 166.9395 16.3110 8.7788 12.9766 81.0679 6.0961 3.2888 7.5963 14.1959 21.4265 15.6428 126.4821 212.2082 146.1927 3.8956 12.9363 9.9130 85.1879 69.4126 132.2317 67.4590 6.8156 29.8935 62.5796 20.0294 22.0281 6.4314 28.3811 35.3344 13.6313 29.6868 60.4552 15.4393 22.5777 2.4258 6.9705 11.6203 7.9512 3.2905 1.2483 269.3586
temp: 298.150 k
press: 1.00000 atm
elementType: 9 8 8 7 7 7 6 6 6 6 6 6 6 6 6 6 6 6 6 6 6 6 6 6 6 6 1 1 1 1 1 1 1 1 1 1 1 1 1 1 1 1 1 1 1 1 1 1 1 1
symmnumber: 1
zpe: 1064293.4 jmol-1
zpe.correction: 0.405368 hartree
zpe.thermalcorrener: 0.430452 hartree
zpe.thermalcorrenthalpy: 0.431396 hartree
zpe.thermalcorrgfe: 0.345712 hartree
zpe.sumelectzpe: -1189.107687 hartree
zpe.sumelectthermal: -1189.082603 hartree
zpe.sumelectthermalent: -1189.081659 hartree
zpe.sumelectthermalfe: -1189.167344 hartree
dipole: -2.9155 -2.7199 0.8827
dipole: 4.0837
quadrupole: -167.4420 -165.7154 -155.0925
quadrupole: 12.9966 -1.0818 4.7206
quadrupole: -4.6920 -2.9655 7.6575 12.9966 -1.0818 4.7206
hfenergy: -1189.5130555 hartree
pointgroup: C01 [X(C20H24F1N3O2)]
dipole: -1.1482197 -0.783968 0.8052097 debye
polarizability: 378.1155025|-6.5202295|224.1600054|-13.8802885|-37.9868067|157.977994 unknown
InChI: InChI=1S/C20H24FN3O2/c1-15-19(14-22-24(15)12-13-25)20(26)8-11-23-9-6-17(7-10-23)16-2-4-18(21)5-3-16/h2-6,14,25H,7-13H2,1H3
charge 0 multiplicity 1
50 atoms
F  9.036408 1.314277 -1.113808
O  -3.073585 -2.258224 1.225747
O  -7.54054 2.688117 -1.663617
N  0.936969 -1.017091 0.538064
N  -6.133692 0.24072 -0.513668
N  -5.279203 1.22353 -1.04941
C  1.983219 -1.989593 0.936008
C  3.292962 -1.715423 0.174542
C  1.31915 0.359427 0.925728
C  -0.409235 -1.398622 1.024869
C  3.696108 -0.247255 0.250038
C  2.767369 0.677606 0.633318
C  -1.521179 -0.59587 0.327533
C  5.089664 0.146516 -0.112155
C  -2.91925 -1.170363 0.583589
C  -4.064589 -0.414308 0.041275
C  -5.444725 -0.756572 0.141941
C  5.358821 1.421691 -0.691513
C  6.192768 -0.729397 0.096467
C  -4.035429 0.813574 -0.701728
C  -7.586877 0.376695 -0.741996
C  -6.11401 -1.927139 0.800163
C  6.668311 1.82366 -1.022882
C  7.512264 -0.349211 -0.229569
C  -8.046035 1.844172 -0.590213
C  7.721802 0.925476 -0.77949
H  1.618971 -3.006245 0.701304
H  2.182161 -1.95219 2.038814
H  4.086007 -2.363548 0.594889
H  3.1762 -2.008229 -0.887423
H  0.681899 1.08069 0.37494
H  1.120018 0.545294 2.018644
H  -0.506066 -1.281705 2.134251
H  -0.567014 -2.469873 0.809563
H  3.054047 1.729904 0.761265
H  -1.327574 -0.597272 -0.765104
H  -1.514118 0.466629 0.64125
H  4.525044 2.095387 -0.913976
H  6.031934 -1.717015 0.539509
H  -3.176417 1.41126 -1.000461
H  -8.106329 -0.274201 -0.017288
H  -7.82589 0.031446 -1.765617
H  -6.724214 -2.506053 0.082084
H  -6.779191 -1.606334 1.624503
H  -5.335469 -2.583519 1.216078
H  6.872963 2.799065 -1.4739
H  8.360261 -1.019072 -0.060049
H  -7.742916 2.221593 0.411007
H  -9.146813 1.880635 -0.661405
H  -6.548563 2.53246 -1.68671
