program: Gaussian 09
title: 000219064
version: EM64L-G09RevD.01
frameworkgroup: C1[X(C17H14N4OS4)]
method: RPBEPBE
basis: SDD
operation: Freq
keyword: #p
keyword: freq=noraman
keyword: PBEPBE/SDD
title: #p freq=noraman PBEPBE/SDD
converged: YES YES NO NO
title: Mulliken charges:
elementType: S S S S O N N N N C C C C C C C C C C C C C C C C C H H H H H H H H H H H H H H
charge: 0.298536 0.308858 0.009512 -0.028736 -0.308431 -0.339907 -0.343377 -0.070880 -0.077113 -0.552889 -0.528916 -0.063450 -0.091550 -0.349123 -0.355746 0.347489 0.355431 0.353225 -0.280341 -0.282264 -0.347272 -0.348133 -0.234914 -0.234772 -0.211295 -0.211860 0.344181 0.344346 0.341941 0.347460 0.249983 0.249936 0.257636 0.257345 0.234778 0.234492 0.235350 0.234946 0.105845 0.149682
chargesum: 0.00000
title: Mulliken charges with hydrogens summed into heavy atoms:
elementType: S S S S O N N N N C C C C C C C C C C C C C C C C C
charge: 0.298536 0.308858 0.115357 0.120945 -0.308431 0.002034 0.004084 -0.070880 -0.077113 -0.208709 -0.184570 -0.063450 -0.091550 -0.349123 -0.355746 0.347489 0.355431 0.353225 -0.030358 -0.032328 -0.089636 -0.090789 -0.000136 -0.000280 0.024054 0.023085
polarizability: 3.89930678e+02 2.95735951e+00 3.32241525e+02 1.89115024e+01 9.82275369e+00 1.73470110e+02
1716.lowfreq: -0.0014 -0.0011 0.0011 2.9843 3.4546 5.4959 13.4480 20.2341 22.3389
frequency: 13.3916 20.2312 22.3247 33.7449 36.0900 65.8390 73.2571 83.6149 97.2767 108.5010 136.6950 160.0964 174.5004 181.9532 191.2325 192.9283 240.0098 258.5762 264.7143 305.0385 316.0291 327.6355 338.1214 350.0043 364.8363 405.7156 433.0931 435.4023 480.6810 483.2093 489.7175 492.4269 494.9376 520.7590 539.0828 564.6989 575.9072 594.2530 627.1513 637.6762 647.0690 654.9337 658.3954 678.1398 679.9308 684.4828 710.4495 723.6037 736.3689 737.2537 769.4247 769.9147 784.1869 830.9864 844.9961 865.9732 866.3185 875.0576 904.9015 950.7968 950.9594 988.5948 988.6517 1009.7971 1012.4986 1015.8321 1029.2546 1035.4703 1048.1385 1083.6780 1109.0398 1122.8168 1123.1130 1171.0198 1171.7084 1172.2432 1216.0445 1230.7389 1235.9455 1242.4322 1257.9053 1277.7725 1279.1863 1293.5989 1338.8881 1379.4605 1381.0819 1431.2221 1431.9204 1446.2943 1446.7597 1459.7889 1491.1762 1516.9964 1522.3931 1568.1901 1569.1209 1605.1077 1606.3711 1610.5046 2411.6803 2435.1029 3070.6884 3084.4431 3139.2658 3139.3210 3152.4526 3152.9455 3165.6555 3166.3778 3176.3587 3176.7331 3487.3211 3515.2736
redmass: 7.9421 7.5859 6.9950 9.2360 7.7043 7.6584 8.1545 7.0599 12.7829 9.0133 8.0627 7.8217 8.0078 7.5281 5.9817 6.1002 5.4277 6.3874 1.1926 2.6048 6.6095 2.5006 2.2047 6.3526 6.8319 8.1960 3.1331 3.2279 4.8091 5.7108 3.3367 8.1269 3.8436 5.7060 2.3592 4.8802 3.6338 3.7352 4.2844 3.6314 6.6688 2.8966 3.2006 6.4150 6.2657 3.2111 6.3665 7.9251 2.4530 2.3731 1.6237 1.6511 2.5513 1.9546 2.1455 1.4004 1.4013 4.1586 3.5248 1.3825 1.3841 1.3238 1.3250 3.3542 2.9314 4.1422 2.6551 3.2253 7.0931 3.2621 1.9559 1.5132 1.5067 1.5097 1.1184 1.3652 1.4403 2.2278 2.5118 1.8633 1.6421 1.5605 1.6557 1.4497 1.8238 4.6852 4.7136 2.8472 2.8337 2.6202 2.6232 1.8266 2.7063 9.0544 9.3902 6.2660 6.3003 6.8981 7.1327 5.7561 1.0377 1.0384 1.0860 1.0868 1.0858 1.0859 1.0903 1.0903 1.0956 1.0956 1.1003 1.1002 1.0783 1.0780
irintensity: 0.3660 0.2467 0.2211 0.3047 0.4612 0.8428 1.6068 8.0808 1.9291 5.7404 1.1728 0.8284 0.6703 0.8710 3.7385 0.7948 9.4068 7.6889 25.3814 17.1918 6.3058 7.3687 13.5075 52.7764 12.2099 83.9146 8.0503 14.4859 2.0618 3.3535 0.3830 3.3803 0.6141 7.4131 5.8545 3.0571 18.5994 9.3375 49.7114 28.0990 11.5307 57.0169 50.6261 12.6723 18.4948 79.9522 5.6200 45.4434 18.7241 23.5671 44.5574 111.9104 21.4060 19.1546 7.6874 0.6296 2.3145 5.3484 132.4897 1.4735 3.9528 0.0104 0.0288 19.2020 17.3025 13.5351 22.7963 4.9027 78.2460 41.3134 54.6938 2.7933 15.1072 6.9487 0.4287 2.7628 111.3303 11.0593 8.9602 1.4084 3.2014 0.2951 7.8161 8.0420 108.1444 17.8216 15.5786 22.7695 22.7523 23.2573 13.6154 91.6248 1466.5946 120.3528 100.1296 2.4340 1.8744 53.6200 9.4373 70.2224 2.4540 18.5379 11.6145 15.4289 1.4386 1.5448 6.5514 7.2051 14.2044 13.3359 18.8018 18.5510 116.8113 63.5287
temp: 298.150 k
press: 1.00000 atm
elementType: 16 16 16 16 8 7 7 7 7 6 6 6 6 6 6 6 6 6 6 6 6 6 6 6 6 6 1 1 1 1 1 1 1 1 1 1 1 1 1 1
symmnumber: 1
zpe: 727627.8 jmol-1
zpe.correction: 0.277139 hartree
zpe.thermalcorrener: 0.301329 hartree
zpe.thermalcorrenthalpy: 0.302273 hartree
zpe.thermalcorrgfe: 0.219162 hartree
zpe.sumelectzpe: -2540.880103 hartree
zpe.sumelectthermal: -2540.855913 hartree
zpe.sumelectthermalent: -2540.854969 hartree
zpe.sumelectthermalfe: -2540.938080 hartree
dipole: -0.5444 5.6404 0.5298
dipole: 5.6914
quadrupole: -133.5031 -174.9382 -190.0592
quadrupole: -0.8388 12.4306 4.1959
quadrupole: 32.6637 -8.7714 -23.8924 -0.8388 12.4306 4.1959
hfenergy: -2541.1572415 hartree
pointgroup: C01 [X(C17H14N4O1S4)]
dipole: -0.216948 0.4456104 -2.1836118 debye
polarizability: 390.7569147|13.3901634|176.4193283|-2.0448275|-26.232975|328.4660704 unknown
InChI: InChI=1S/C17H14N4OS4/c22-17(20-13(23)15-18-9-5-1-3-7-11(9)25-15)21-14(24)16-19-10-6-2-4-8-12(10)26-16/h1-8,13-14,20-21,23-24H
charge 0 multiplicity 1
40 atoms
S  -5.219875 -0.34003 1.608212
S  5.26396 -0.616608 1.508647
S  -2.643204 2.163183 2.757684
S  2.420274 -2.546015 2.372393
O  -0.049408 -0.439543 3.256855
N  -1.159348 0.200924 1.297538
N  1.148953 -0.23339 1.265259
N  -3.421189 0.285839 -0.291487
N  3.360637 -0.00787 -0.290784
C  -2.414911 0.383305 1.96857
C  2.377305 -0.651473 1.890994
C  -3.547052 0.14427 1.014456
C  3.524343 -0.390446 0.960497
C  -5.730763 -0.333122 -0.13282
C  5.750405 -0.104569 -0.163071
C  -4.626509 0.027501 -0.974599
C  4.58936 0.166268 -0.959446
C  -0.020582 -0.169652 2.013505
C  -7.000157 -0.623901 -0.668145
C  7.050073 0.021814 -0.68976
C  -4.804179 0.094875 -2.376522
C  4.738791 0.572264 -2.306267
C  -7.159248 -0.551526 -2.070402
C  7.181033 0.428312 -2.03666
C  -6.072312 -0.19598 -2.915042
C  6.03706 0.700191 -2.836062
H  -2.453656 -0.247364 2.870434
H  2.499221 -0.15333 2.865667
H  -1.150249 0.385328 0.290104
H  1.18805 -0.08845 0.250533
H  -7.842603 -0.898118 -0.026361
H  7.936153 -0.186775 -0.082956
H  -3.957486 0.369125 -3.012542
H  3.848509 0.777288 -2.907897
H  -8.137281 -0.773519 -2.510224
H  8.181639 0.534122 -2.469025
H  -6.225061 -0.148344 -3.998217
H  6.169327 1.012801 -3.877052
H  -2.779549 2.802283 1.534215
H  1.44463 -2.356068 3.343077
