program: Gaussian 09
title: 000219050
version: EM64L-G09RevD.01
frameworkgroup: C1[X(C23H26N2O)]
method: RPBEPBE
basis: SDD
operation: Freq
keyword: #p
keyword: freq=noraman
keyword: PBEPBE/SDD
title: #p freq=noraman PBEPBE/SDD
converged: YES YES NO NO
title: Mulliken charges:
elementType: O N N C C C C C C C C C C C C C C C C C C C C C C C H H H H H H H H H H H H H H H H H H H H H H H H H H
charge: -0.444989 -0.073243 -0.402339 -0.353112 -0.401939 -0.382786 -0.396347 -0.519346 -0.381033 0.321107 -0.560936 -0.400017 0.406857 0.159869 0.317247 0.213757 -0.450043 -0.604905 -0.375917 -0.385169 -0.319124 0.278989 -0.351355 -0.242460 -0.247541 -0.244994 0.169290 0.208903 0.185106 0.214148 0.202716 0.210668 0.234622 0.182243 0.211501 0.224315 0.205756 0.207330 0.204729 0.208111 0.212630 0.268192 0.302617 0.224322 0.224973 0.241664 0.228145 0.247380 0.222716 0.222512 0.227550 0.347630
chargesum: 0.00000
title: Mulliken charges with hydrogens summed into heavy atoms:
elementType: O N N C C C C C C C C C C C C C C C C C C C C C C C
charge: -0.097359 -0.073243 -0.099722 0.025081 -0.002686 0.030598 0.020518 -0.083529 0.032053 0.321107 -0.148096 -0.187388 0.406857 0.159869 0.317247 0.213757 -0.181850 -0.380583 -0.150944 -0.143505 -0.090978 0.278989 -0.103976 -0.019744 -0.025028 -0.017444
polarizability: 3.90516347e+02 7.88431774e+00 2.63597775e+02 2.05878611e+01 -8.26474284e+00 1.63186749e+02
1716.lowfreq: -17.8964 -5.2796 -1.8917 -0.0012 -0.0004 0.0006 8.4597 10.4572 23.0815
frequency: -12.0113 10.4319 23.0750 33.1452 45.1027 56.9375 83.3907 97.1817 108.4042 133.0929 140.3973 153.4589 157.7172 200.9555 215.8129 231.5682 252.2933 267.7680 304.3356 320.3897 338.3344 346.9857 355.5316 383.0268 404.7307 416.8607 422.9241 434.2390 441.6619 451.8214 482.7636 492.7485 517.9019 549.9185 564.5589 581.8139 595.1890 616.5661 645.8916 684.8014 697.7016 700.5128 734.4322 745.6299 751.2900 755.3547 758.4756 787.0241 794.7665 801.4785 805.0334 816.7709 825.4190 831.4807 847.6508 901.9908 914.1839 923.4788 930.0121 936.9913 960.9360 972.6786 973.0619 988.3305 989.9124 992.4706 1010.0213 1028.5522 1032.4187 1051.5077 1058.5733 1071.9890 1080.1999 1083.0606 1086.7425 1098.3917 1119.8831 1128.0663 1145.0323 1151.0321 1172.5735 1182.0087 1196.6761 1197.9828 1208.4301 1224.7279 1234.8712 1238.9266 1244.6176 1256.1805 1264.1316 1275.2802 1280.8601 1299.5667 1303.3600 1310.4049 1319.0344 1321.1157 1334.5420 1338.6652 1344.5428 1364.1256 1366.9902 1380.0421 1395.5293 1397.3522 1436.4731 1440.6022 1448.1686 1459.1187 1459.8200 1462.9278 1465.8925 1470.2911 1479.0809 1481.0494 1488.3396 1488.5985 1563.1146 1581.7620 1601.4572 1611.4003 1636.4566 1666.7931 2773.0436 2814.8147 2844.0881 2959.0541 2968.1545 2973.6387 2976.1417 2992.9638 3003.0308 3007.0391 3025.7642 3026.7943 3030.0931 3050.5762 3113.4165 3118.0745 3121.0506 3127.7848 3136.4530 3141.7147 3149.5977 3163.9905 3174.2103 3217.8847 3585.1127 3616.9618
redmass: 3.7060 5.5347 5.1718 4.9612 3.4092 3.8595 4.5224 2.1785 2.4947 3.5416 3.9283 5.3614 3.1426 2.9003 2.7089 2.8333 3.1711 3.4801 4.2673 1.1828 2.0682 4.5191 4.0506 3.4846 2.8267 3.3199 3.1409 3.7546 4.3914 3.9400 1.2321 4.0684 2.8985 4.2329 3.7003 3.4622 3.1979 6.3445 3.7031 4.3945 1.8065 4.6450 1.1935 3.2568 3.4291 1.7177 3.2333 1.3505 1.6202 2.0022 1.5499 4.1313 1.3692 1.7690 1.2551 1.4468 1.5295 3.5820 1.3304 3.2988 2.6282 2.1902 1.4774 3.8699 2.0002 1.5075 3.7593 2.5080 2.0726 2.1214 2.6326 2.6698 1.8860 2.1028 1.6892 1.4380 1.5179 1.9590 1.3300 1.6807 1.0551 1.5259 1.1605 1.3817 1.7235 1.2356 1.5478 1.4280 2.3556 1.4064 2.4945 1.4129 1.1088 1.3108 1.6828 1.4893 1.4255 1.5073 1.3487 1.8038 1.5702 1.9651 1.5154 5.3436 4.1165 1.5141 2.3374 2.9658 1.1010 1.0904 1.0845 2.4929 1.3103 1.0924 1.1010 4.2078 1.7807 1.2708 6.1165 5.6915 6.2272 5.9649 7.2556 6.8488 1.0716 1.0702 1.0710 1.0614 1.0600 1.0600 1.0610 1.0815 1.0881 1.0948 1.0950 1.0971 1.0971 1.1041 1.0913 1.0893 1.0850 1.0871 1.0897 1.0920 1.0955 1.1013 1.0954 1.0982 1.0659 1.0809
irintensity: 0.3787 0.1771 0.0582 0.0726 0.0881 0.0104 0.1591 0.0216 0.2340 0.5839 1.0784 3.9760 1.4926 0.3282 3.5558 0.5556 0.3849 0.5744 3.3618 117.5899 11.0906 10.8933 14.7959 1.8728 0.0019 6.4563 12.0006 2.9142 3.8029 2.8475 103.8789 6.2863 2.8134 7.5139 1.8187 10.4585 10.6906 0.0137 10.8955 5.9128 38.6180 9.7096 5.9961 0.6448 26.3580 49.9027 3.2823 1.7815 69.8658 3.9571 7.4808 7.5228 10.9671 38.1798 0.0616 2.3867 3.9283 23.5453 0.1229 2.0361 29.4469 2.2769 0.9860 0.5168 2.4957 2.9916 1.7201 16.0143 4.9799 6.5815 9.5476 6.8393 2.0067 1.1023 7.6882 76.2248 85.3816 46.8305 126.1991 13.3335 0.4053 20.0436 1.2996 6.2296 11.2303 5.9064 5.4140 0.4161 35.8101 3.9345 1.6848 6.8110 1.2102 17.1365 0.9946 3.4306 5.4806 2.7234 12.1475 18.6121 1.3626 3.0805 36.2402 3.2483 20.4574 3.4536 7.2825 11.5483 6.0615 6.2012 7.1136 34.2550 14.5918 3.7666 2.9527 68.5845 27.7452 12.1202 1.1545 2.3557 20.9883 19.3235 29.6582 10.7246 78.1385 87.4209 143.2639 20.6230 0.2824 29.1009 63.5714 42.5448 17.2916 6.8709 15.7831 26.9628 40.1757 92.9475 18.5339 25.3205 2.1769 1.1854 11.8636 22.0595 46.6917 22.7008 9.0385 1.3382 26.2909 64.6130
temp: 298.150 k
press: 1.00000 atm
elementType: 8 7 7 6 6 6 6 6 6 6 6 6 6 6 6 6 6 6 6 6 6 6 6 6 6 6 1 1 1 1 1 1 1 1 1 1 1 1 1 1 1 1 1 1 1 1 1 1 1 1 1 1
symmnumber: 1
zpe: 1140349.8 jmol-1
zpe.correction: 0.434336 hartree
zpe.thermalcorrener: 0.457183 hartree
zpe.thermalcorrenthalpy: 0.458127 hartree
zpe.thermalcorrgfe: 0.379861 hartree
zpe.sumelectzpe: -1074.870508 hartree
zpe.sumelectthermal: -1074.847661 hartree
zpe.sumelectthermalent: -1074.846717 hartree
zpe.sumelectthermalfe: -1074.924983 hartree
dipole: 0.1784 -1.9771 0.0795
dipole: 1.9868
quadrupole: -152.1235 -142.3203 -159.2070
quadrupole: -24.1377 -1.4908 -6.5734
quadrupole: -0.9066 8.8966 -7.9901 -24.1377 -1.4908 -6.5734
hfenergy: -1075.304844 hartree
pointgroup: C01 [X(C23H26N2O1)]
dipole: -0.065583 0.7757293 -0.0701215 debye
polarizability: 390.4390431|4.332143|263.9696116|-22.1812282|-4.8657602|162.8922159 unknown
InChI: InChI=1S/C23H26N2O/c26-21-9-10-23-22(16-21)20(17-24-23)8-4-5-13-25-14-11-19(12-15-25)18-6-2-1-3-7-18/h1-3,6-7,9-11,16-17,24,26H,4-5,8,12-15H2
charge 0 multiplicity 1
52 atoms
O  -6.065359 -3.311969 0.926956
N  1.887156 0.637285 0.41113
N  -6.437037 2.084566 -0.469801
C  0.450798 0.680979 0.773552
C  2.776849 0.877037 1.572218
C  -0.491707 0.731145 -0.447086
C  2.258582 -0.601554 -0.306897
C  4.227329 1.097181 1.105016
C  -1.964094 0.947165 -0.03301
C  4.691277 -0.02522 0.181173
C  -2.929078 0.989778 -1.251468
C  3.751501 -0.792478 -0.445056
C  -4.379163 1.156211 -0.866277
C  -5.248386 0.140457 -0.294926
C  6.155488 -0.229855 -0.01469
C  -6.530768 0.748483 -0.056518
C  -5.143652 2.321752 -0.957226
C  -5.062414 -1.232213 0.028061
C  6.691984 -1.474077 -0.457822
C  7.073233 0.827007 0.248009
C  -7.613915 0.026927 0.492778
C  -6.147776 -1.94455 0.57359
C  -7.41185 -1.328369 0.808321
C  8.077463 -1.645713 -0.650513
C  8.461801 0.657419 0.05543
C  8.973547 -0.579127 -0.397894
H  0.163161 -0.192148 1.420313
H  0.28902 1.594549 1.37872
H  2.749316 0.024289 2.300232
H  2.413661 1.77551 2.104962
H  -0.41715 -0.208158 -1.031411
H  -0.158976 1.551503 -1.113444
H  1.80778 -0.579524 -1.31868
H  1.82846 -1.511647 0.201063
H  4.890495 1.161071 1.989969
H  4.290805 2.070648 0.57898
H  -2.28335 0.141414 0.658474
H  -2.061556 1.895809 0.53184
H  -2.799425 0.054796 -1.835408
H  -2.619312 1.816998 -1.91989
H  4.054873 -1.594069 -1.130824
H  -4.85756 3.301739 -1.336103
H  -7.189886 2.767298 -0.434845
H  -4.097099 -1.724213 -0.14959
H  6.020192 -2.3228 -0.62838
H  6.698657 1.797416 0.590997
H  -8.587807 0.495547 0.672066
H  -8.213251 -1.937682 1.235871
H  8.462397 -2.615593 -0.986278
H  9.143441 1.491397 0.258399
H  10.050975 -0.714156 -0.544006
H  -5.161673 -3.663859 0.733127
