program: Gaussian 09
title: 000219001
version: EM64L-G09RevD.01
frameworkgroup: C1[X(C8H17O3PS)]
method: RPBEPBE
basis: SDD
operation: Freq
keyword: #p
keyword: freq=noraman
keyword: PBEPBE/SDD
title: #p freq=noraman PBEPBE/SDD
converged: YES YES NO NO
title: Mulliken charges:
elementType: S P O O O C C C C C C C C H H H H H H H H H H H H H H H H H
charge: -0.018281 1.087248 -0.546932 -0.474729 -0.603268 0.011251 -0.413085 -0.429094 -0.398423 -0.396259 -0.388637 -0.829843 -0.483227 0.242375 0.205256 0.226953 0.220157 0.207436 0.207932 0.200803 0.199519 0.208295 0.204234 0.192445 0.264818 0.274376 0.303070 0.242865 0.234359 0.248386
chargesum: 0.00000
title: Mulliken charges with hydrogens summed into heavy atoms:
elementType: S P O O O C C C C C C C C
charge: -0.018281 1.087248 -0.546932 -0.474729 -0.603268 0.253626 0.019124 -0.001501 0.010311 0.011556 0.008041 0.012420 0.242383
polarizability: 1.65703272e+02 1.13283243e+01 1.41086372e+02 3.27897949e+00 1.31991102e+00 1.16187114e+02
1716.lowfreq: -31.4574 -12.0997 -4.6186 -0.0018 0.0015 0.0026 10.2331 29.1525 44.8494
frequency: -19.2622 25.8170 44.7146 63.2775 86.2348 102.0221 115.6337 139.7046 144.1092 156.5875 184.9666 207.2449 211.6054 272.0761 278.2042 314.8292 318.2353 366.2174 417.3473 426.3507 445.6682 472.5974 519.6777 635.8457 637.9713 716.2887 785.7254 791.3571 843.0563 879.6567 892.5406 917.2779 921.5528 963.3736 975.5334 991.2006 996.2396 1039.9261 1041.6013 1050.8664 1082.5198 1105.8678 1112.9694 1127.4095 1148.0444 1195.8949 1238.4149 1251.6773 1257.3682 1303.1976 1306.8747 1329.8848 1334.3514 1339.5395 1348.4333 1351.3113 1359.6834 1420.4059 1447.3736 1455.3147 1459.2217 1462.7534 1464.3739 1464.9968 1471.7708 1474.0996 1479.7186 2971.7049 2973.5044 2974.4011 2981.5608 2987.4161 2989.7725 2997.4749 3012.4007 3036.0491 3038.0690 3046.0239 3056.1418 3065.5478 3086.9284 3130.3252 3134.0548 3148.8171
redmass: 3.1973 4.1571 3.5652 3.4107 3.5417 1.1078 4.1013 1.6600 1.8558 4.2793 4.2885 1.9509 4.5959 5.5925 7.0990 2.3116 5.1076 5.1255 4.2683 3.1952 2.6944 6.2970 1.9473 8.7058 8.7145 6.2647 1.5210 2.4140 2.1019 1.7490 1.6663 4.5840 1.6814 9.5607 1.1900 1.3153 2.2768 7.6903 1.9503 1.1571 1.3160 2.6518 1.2447 1.2911 2.2714 1.4978 1.3248 1.2686 1.2957 1.1888 1.2980 1.3474 1.3983 1.4743 1.1258 1.5294 1.4294 1.1214 1.0508 1.0499 1.0885 1.0560 1.0918 1.0891 1.0834 1.0534 1.0973 1.0659 1.0627 1.0618 1.0310 1.0758 1.0623 1.0699 1.0284 1.0959 1.0977 1.1010 1.1032 1.1031 1.1026 1.1039 1.1039 1.1063
irintensity: 0.9020 1.2744 0.9474 5.6022 1.0437 0.7364 4.7297 3.7647 1.2618 7.1585 0.8733 2.1006 6.4829 5.1517 2.9142 1.3210 0.3879 16.8079 49.5247 2.9694 7.2868 75.2342 8.8454 55.3016 59.7695 141.9140 6.1571 30.2101 34.1972 21.7553 13.1490 217.5150 5.0937 117.6355 6.6288 31.0572 46.5642 88.7688 1.1718 6.6044 2.0514 0.6237 0.4756 0.8399 3.3410 2.2279 1.3888 2.1831 3.8625 1.2344 0.1659 1.0198 17.7728 0.5905 2.6006 3.8107 15.5462 5.6454 15.3425 11.5257 4.2053 13.6548 7.4045 9.2803 22.1851 13.4572 2.6780 32.3165 29.5262 37.1161 40.2435 0.4608 13.0588 36.4790 22.9183 60.3888 59.7498 33.0669 18.5903 69.2612 22.8358 13.2454 1.4219 10.6665
temp: 298.150 k
press: 1.00000 atm
elementType: 16 15 8 8 8 6 6 6 6 6 6 6 6 1 1 1 1 1 1 1 1 1 1 1 1 1 1 1 1 1
symmnumber: 1
zpe: 644887.7 jmol-1
zpe.correction: 0.245625 hartree
zpe.thermalcorrener: 0.261563 hartree
zpe.thermalcorrenthalpy: 0.262507 hartree
zpe.thermalcorrgfe: 0.201026 hartree
zpe.sumelectzpe: -1278.930803 hartree
zpe.sumelectthermal: -1278.914866 hartree
zpe.sumelectthermalent: -1278.913921 hartree
zpe.sumelectthermalfe: -1278.975402 hartree
dipole: 1.1439 -0.1611 -2.6039
dipole: 2.8486
quadrupole: -82.5723 -88.5179 -102.9755
quadrupole: 2.0326 5.6633 -4.0043
quadrupole: 8.7829 2.8373 -11.6203 2.0326 5.6633 -4.0043
hfenergy: -1279.1764282 hartree
pointgroup: C01[X(C8H17O3P1S1)]
dipole: -0.4046007 -0.1416646 -1.0354931 debye
polarizability: 168.0809095|7.7071492|137.233062|-3.5885622|-5.9515208|117.6627872 unknown
InChI: InChI=1S/C7H14O3P.CH3S/c1-9-11(8)10-7-5-3-2-4-6-7;1-2/h7H,2-6H2,1H3;1H3
charge 0 multiplicity 1
30 atoms
S  2.652268 0.518037 -0.910797
P  1.613146 -0.482386 0.896891
O  0.12973 -1.046092 0.21195
O  2.424362 -1.98013 1.178295
O  1.542024 0.419559 2.20285
C  -1.134927 -0.268678 0.461936
C  -1.209129 0.971618 -0.443845
C  -2.273577 -1.259332 0.185263
C  -2.57931 1.675487 -0.266445
C  -3.645744 -0.557941 0.35667
C  -3.750647 0.701204 -0.537175
C  3.894724 1.537612 0.098102
C  2.540762 -2.95559 0.070689
H  -1.141161 0.040951 1.527074
H  -1.084519 0.650955 -1.496656
H  -0.384562 1.670557 -0.210007
H  -2.185404 -2.126392 0.864815
H  -2.169583 -1.635729 -0.851128
H  -2.635778 2.548109 -0.944215
H  -2.660467 2.070289 0.767351
H  -3.78041 -0.265658 1.41833
H  -4.456342 -1.271802 0.117017
H  -4.717762 1.210987 -0.364267
H  -3.732265 0.395471 -1.60348
H  4.127421 2.422428 -0.513557
H  4.80134 0.947155 0.289596
H  3.422363 1.845988 1.044262
H  3.142769 -3.776114 0.488248
H  3.060432 -2.501892 -0.794227
H  1.543243 -3.318774 -0.230039
