program: Gaussian 09
title: 000218995
version: EM64L-G09RevD.01
frameworkgroup: C1[X(C18H24N4O2)]
method: RPBEPBE
basis: SDD
operation: Freq
keyword: #p
keyword: freq=noraman
keyword: PBEPBE/SDD
title: #p freq=noraman PBEPBE/SDD
converged: YES YES NO NO
title: Mulliken charges:
elementType: O O N N N N C C C C C C C C C C C C C C C C C C H H H H H H H H H H H H H H H H H H H H H H H H
charge: -0.282977 -0.294731 -0.167148 -0.336213 -0.086419 -0.087404 -0.409658 0.109509 0.253470 0.175918 -0.397523 0.119326 0.161893 -0.366868 -0.296169 -0.326186 -0.325471 -0.224120 -0.236491 -0.762973 0.164356 -0.673038 -0.698968 -0.498989 0.220549 0.267015 0.243532 0.222601 0.238833 0.310180 0.185908 0.204776 0.185950 0.204548 0.225866 0.228589 0.239289 0.237647 0.240510 0.224769 0.211712 0.209147 0.216517 0.253267 0.208109 0.239602 0.228458 0.239501
chargesum: 0.00000
title: Mulliken charges with hydrogens summed into heavy atoms:
elementType: O O N N N N C C C C C C C C C C C C C C C C C C
charge: -0.282977 -0.294731 -0.167148 -0.336213 -0.086419 -0.087404 0.077906 0.109509 0.253470 0.175918 0.068610 0.119326 0.161893 -0.128035 0.014011 0.064497 0.065028 0.001746 -0.007902 -0.045527 0.164356 -0.027411 -0.021076 0.208573
polarizability: 3.09222591e+02 -1.44402916e+01 2.93048414e+02 1.42725524e+01 5.92295018e+00 1.31133240e+02
1716.lowfreq: -7.9595 -4.2678 -0.0009 -0.0004 0.0004 2.0697 13.6033 19.7818 25.7424
frequency: 12.8943 19.6127 25.4880 31.4333 59.3179 63.0306 70.5591 81.2202 103.1751 104.4349 110.5993 119.2214 137.5415 147.2038 171.1300 205.5867 214.8583 223.2896 240.0473 253.2540 275.0656 281.2615 287.5988 304.2482 321.8641 333.9043 345.9074 376.6997 398.3869 438.6963 439.8329 459.3560 487.9489 501.8278 566.1073 580.5520 629.9561 632.3183 664.7834 685.9198 702.4660 718.1807 735.8490 738.1486 742.7529 755.7977 768.6621 781.7470 797.7268 803.9333 860.3411 871.2810 917.3567 930.7728 947.2757 970.4620 987.9791 988.6704 992.0005 1015.0884 1032.0380 1042.7888 1054.5828 1067.1012 1072.5034 1072.9078 1082.1793 1090.4214 1112.8945 1122.9496 1137.5334 1145.3391 1152.0560 1177.7999 1207.2148 1213.5984 1242.6793 1252.0320 1273.0805 1287.8476 1288.5283 1308.8039 1316.4002 1330.7254 1344.0830 1355.7460 1364.9252 1381.1623 1384.0082 1388.4968 1392.9570 1396.2330 1397.4508 1413.2559 1427.7493 1450.8591 1455.9653 1457.1971 1462.6037 1464.3906 1466.3398 1466.8355 1471.2446 1472.8429 1477.0692 1479.7688 1485.7867 1489.9110 1490.9135 1498.6257 1571.7373 1595.6473 1618.6854 1628.8796 2847.1041 2855.9658 2956.5969 2977.9972 2985.1956 2995.5949 3000.4144 3011.2363 3022.2911 3035.5005 3036.5111 3073.8790 3074.3504 3079.0095 3083.9512 3091.5678 3100.3522 3101.5866 3114.8976 3135.6003 3141.9317 3150.9279 3166.1266 3186.0229
redmass: 3.5698 4.0721 3.3050 4.1664 2.3129 3.6351 3.7532 1.0945 1.8055 2.2611 3.8888 1.7937 2.1240 3.3517 3.6433 3.8043 5.1371 1.7558 1.5125 2.8471 3.4244 2.9257 1.8141 2.4432 4.8947 6.0206 4.2113 3.1865 3.9837 3.9733 4.3379 2.8873 3.0810 5.6142 4.3614 5.0821 5.9712 5.4958 4.2284 6.1319 7.9114 9.4107 6.0550 4.1691 2.6265 1.3617 1.8795 1.9435 1.1920 1.3133 1.3532 4.4837 1.9685 5.9440 1.3466 4.9285 1.2891 2.4416 2.8434 1.9936 3.6175 1.4952 3.3006 3.5020 2.4043 2.3926 2.6507 1.7028 1.2594 1.7442 1.5684 1.4308 1.8363 1.3026 2.9669 2.6388 3.6356 1.7243 2.0002 1.2372 1.3244 1.3044 1.5481 1.4686 4.9909 1.3114 1.3449 2.4606 1.9338 1.2820 1.5269 1.7586 1.3158 3.5495 1.5948 1.0510 1.0462 1.2266 1.1352 1.0559 1.1214 1.0935 1.9162 1.1614 1.1536 3.1336 1.0593 4.3381 1.1048 1.0632 9.1349 7.3856 9.9972 8.2440 1.0719 1.0709 1.0587 1.0358 1.0357 1.0369 1.0295 1.0988 1.0926 1.0865 1.0608 1.0966 1.0988 1.0984 1.1007 1.1005 1.1043 1.1066 1.1002 1.0859 1.1045 1.0914 1.0976 1.0968
irintensity: 0.1907 0.1372 0.0873 0.4027 0.7434 1.7695 0.1640 0.0391 1.0884 0.3841 1.7979 0.0834 1.0598 4.5279 0.9362 2.1193 1.2855 0.7958 0.9741 1.3780 5.8978 5.5830 2.9038 4.8563 8.9420 3.0007 12.8227 7.5848 5.2556 4.3821 3.6374 0.4145 3.5140 0.2904 3.5927 5.1239 3.7313 5.6909 1.1828 18.7380 3.4832 4.8702 13.4910 1.5830 12.1229 96.0261 5.9224 8.4193 3.9322 5.1773 0.8564 9.6836 1.3182 5.2679 4.0270 15.0701 2.2167 12.0185 84.5476 22.6597 16.4361 3.9872 4.7668 206.0808 181.1071 27.9329 13.3713 31.6953 0.0744 13.8966 87.7682 40.0185 13.2028 6.5631 53.8184 26.8699 11.6666 2.3218 11.6170 10.7236 13.9582 32.7726 20.9748 0.9169 197.5788 2.3441 1.9731 72.4517 91.7955 55.6337 21.5531 37.7924 45.0070 17.4168 136.0300 12.8260 13.6403 10.2842 1.6394 10.1995 16.5677 10.4671 4.5868 1.3045 16.8195 32.2634 21.4551 101.5076 10.8154 11.1294 325.7117 33.4071 194.9614 148.8347 36.1362 196.0868 36.4493 21.2828 34.6603 18.3250 55.1953 5.9730 30.8496 20.7184 37.1421 12.0412 41.1691 56.5410 32.8038 45.2212 28.9228 8.0204 13.6687 2.7404 18.0403 20.3334 15.9516 14.4950
temp: 298.150 k
press: 1.00000 atm
elementType: 8 8 7 7 7 7 6 6 6 6 6 6 6 6 6 6 6 6 6 6 6 6 6 6 1 1 1 1 1 1 1 1 1 1 1 1 1 1 1 1 1 1 1 1 1 1 1 1
symmnumber: 1
zpe: 1037716.3 jmol-1
zpe.correction: 0.395245 hartree
zpe.thermalcorrener: 0.419956 hartree
zpe.thermalcorrenthalpy: 0.420900 hartree
zpe.thermalcorrgfe: 0.337493 hartree
zpe.sumelectzpe: -1067.976636 hartree
zpe.sumelectthermal: -1067.951925 hartree
zpe.sumelectthermalent: -1067.950981 hartree
zpe.sumelectthermalfe: -1068.034388 hartree
dipole: -1.9980 0.3035 0.8316
dipole: 2.1854
quadrupole: -125.0457 -135.0110 -146.0781
quadrupole: -10.5380 -1.3102 -1.9196
quadrupole: 10.3326 0.3672 -10.6998 -10.5380 -1.3102 -1.9196
hfenergy: -1068.3718808 hartree
pointgroup: C01 [X(C18H24N4O2)]
dipole: 0.7852341 0.1776882 -0.3017707 debye
polarizability: 309.6199508|11.2845588|288.5693655|15.8475526|26.5488856|135.2149289 unknown
InChI: InChI=1S/C18H24N4O2/c1-5-20(6-2)11-12-21-14-9-7-8-10-15(14)22-16(17(23)24-4)13(3)19-18(21)22/h7-10H,5-6,11-12H2,1-4H3
charge 0 multiplicity 1
48 atoms
O  -4.526973 -1.62495 -0.555282
O  -4.313967 0.676721 -0.186081
N  0.801596 0.46854 0.667523
N  -1.413877 0.226375 0.239879
N  4.315054 -0.53868 -0.380828
N  -0.273033 -1.773483 0.142318
C  2.221731 0.111815 0.807172
C  -0.193817 -0.439126 0.352637
C  0.199435 1.748398 0.732815
C  -1.210076 1.60686 0.47124
C  2.933502 -0.041186 -0.56567
C  -2.377545 -0.773217 -0.068374
C  -1.634193 -1.990942 -0.11894
C  0.760142 3.010932 1.006269
C  -2.072704 2.717134 0.480077
C  5.375641 0.405896 -0.820323
C  4.515267 -1.934763 -0.851175
C  -0.110391 4.124445 1.014124
C  -1.500554 3.979896 0.755874
C  -2.133991 -3.375745 -0.40519
C  -3.779466 -0.468013 -0.261631
C  6.720417 0.190073 -0.098042
C  3.685654 -2.968798 -0.065125
C  -5.97343 -1.39115 -0.760227
H  2.727651 0.878814 1.41747
H  2.289267 -0.846662 1.347701
H  2.337002 -0.739566 -1.187839
H  2.928806 0.935402 -1.090124
H  1.829489 3.131054 1.205816
H  -3.137791 2.580105 0.279061
H  5.53694 0.360457 -1.927918
H  5.020972 1.429472 -0.595483
H  4.282392 -2.026844 -1.943531
H  5.586354 -2.178623 -0.732925
H  0.297496 5.119167 1.223699
H  -2.144713 4.86523 0.770178
H  -2.91268 -3.679235 0.316545
H  -2.597659 -3.43842 -1.40569
H  -1.289322 -4.080476 -0.349512
H  6.577186 0.248104 0.995217
H  7.166129 -0.792845 -0.332827
H  7.44728 0.965475 -0.403933
H  3.942899 -2.931029 1.008756
H  2.597471 -2.8036 -0.168002
H  3.902736 -3.986838 -0.438748
H  -6.42817 -0.960642 0.148129
H  -6.388054 -2.386274 -0.976223
H  -6.138204 -0.700765 -1.604863
