program: Gaussian 09
title: 000218972
version: EM64L-G09RevD.01
frameworkgroup: C1[X(C19H31NO2)]
method: RPBEPBE
basis: SDD
operation: Freq
keyword: #p
keyword: freq=noraman
keyword: PBEPBE/SDD
title: #p freq=noraman PBEPBE/SDD
converged: YES YES NO NO
title: Mulliken charges:
elementType: O O N C C C C C C C C C C C C C C C C C C C H H H H H H H H H H H H H H H H H H H H H H H H H H H H H H H
charge: -0.444868 -0.324892 -0.233176 0.376789 0.400916 -0.532834 -0.508221 -0.390085 -0.756418 -0.749507 -0.744266 -0.754456 -0.143509 -0.335854 0.259077 0.315051 -0.341222 -0.532150 -0.445081 -0.797492 0.461896 -0.813711 0.225155 0.219608 0.216898 0.216723 0.207453 0.214921 0.208761 0.221983 0.223507 0.246329 0.210862 0.202681 0.212251 0.216947 0.222041 0.212112 0.217102 0.218109 0.236476 0.233479 0.233758 0.346541 0.248396 0.234149 0.228342 0.229736 0.219220 0.232603 0.227267 0.228226 0.222377
chargesum: 0.00000
title: Mulliken charges with hydrogens summed into heavy atoms:
elementType: O O N C C C C C C C C C C C C C C C C C C C
charge: -0.098327 -0.324892 -0.233176 0.376789 0.400916 -0.088071 -0.074599 0.032288 -0.102166 -0.089635 -0.093027 -0.107133 0.092967 0.131382 0.259077 0.315051 -0.092826 -0.298000 -0.216739 -0.115933 0.461896 -0.135841
polarizability: 2.73531847e+02 2.47574876e+01 1.81838321e+02 -1.13065700e+00 1.20306834e+00 2.02796839e+02
1716.lowfreq: -17.9441 -4.5965 -0.0004 0.0003 0.0005 9.4509 19.5404 21.4494 27.9821
frequency: 16.3783 19.6380 27.5231 49.6728 49.8862 70.4109 88.5715 114.4037 128.9658 140.8665 150.5721 156.7913 177.6282 200.4804 203.0698 229.5730 242.8753 254.3310 263.5004 276.5727 289.6784 299.6588 304.4471 308.8745 317.3420 340.8545 345.7102 362.3539 394.0241 407.2472 417.0839 427.2885 441.3921 449.6879 478.6123 483.8133 505.3637 553.7998 559.9341 562.9817 582.9433 593.0345 691.5929 711.3628 721.8265 732.5893 777.2687 806.1936 819.1120 829.9539 849.6791 886.6516 890.3413 903.7184 906.6965 920.8214 924.1170 932.3049 934.6145 939.2353 957.4801 966.8139 978.2125 984.8037 1008.9812 1018.2238 1023.0268 1027.7495 1043.5210 1049.5570 1073.7912 1083.7333 1107.3659 1122.5063 1128.6251 1167.7269 1170.5116 1175.1897 1192.2074 1199.8571 1210.9931 1220.4301 1238.2073 1239.6313 1253.9082 1259.5058 1269.1755 1274.9961 1293.7294 1309.0938 1320.9014 1337.9801 1351.4803 1362.0077 1365.8949 1372.3819 1377.5088 1383.1636 1384.9458 1387.7289 1396.2622 1399.4644 1411.1482 1451.1056 1452.6612 1455.9829 1457.8830 1460.9497 1463.5441 1470.0728 1470.9432 1471.6690 1473.1048 1477.7631 1479.8638 1481.5429 1486.3933 1489.2068 1493.2763 1500.4359 1596.1868 1622.3818 2947.4023 2969.3476 2971.6175 2972.7782 2973.4170 2975.5707 2978.7357 2984.2431 2996.0353 3001.9850 3040.9824 3049.4706 3050.0830 3052.9865 3054.0141 3060.9400 3062.3605 3067.2988 3067.9850 3071.0662 3076.3878 3080.1355 3080.4264 3080.9530 3082.2572 3084.3220 3087.5625 3112.7471 3126.8145 3164.6122 3528.6377
redmass: 3.4916 4.3926 3.6487 1.1962 2.1117 4.1095 4.1508 4.1368 3.4675 1.1269 2.3299 3.6643 3.6919 2.6262 1.0659 1.7779 1.4894 2.2419 2.6183 2.5142 1.4918 1.2961 1.3260 2.1653 3.0688 2.6852 3.4864 2.2589 2.2393 2.1170 1.8897 1.5254 2.8867 3.6284 2.2494 3.7626 3.3637 3.3685 3.0309 4.5908 3.0474 3.4962 4.4805 5.3785 3.2551 2.1605 3.7493 1.4064 2.4378 2.9853 2.3392 1.3133 1.8367 1.7342 2.1250 2.5314 1.7369 1.8239 1.4283 2.2639 1.8474 2.2588 1.4690 1.2712 1.5050 1.4964 1.8822 1.8250 1.5060 1.5528 1.4437 2.1156 2.2321 1.9981 2.3044 2.2045 1.5878 2.6530 2.9893 1.8326 1.9777 1.7876 1.6040 1.4141 2.8844 2.0584 3.0848 1.4492 1.5874 1.4054 1.7213 1.2766 1.3133 1.3175 1.2373 1.4124 2.4919 1.3104 1.2516 1.2255 1.2394 1.3101 2.9037 1.0786 1.1193 1.0776 1.0716 1.0467 1.0609 1.0471 1.0764 1.1922 1.0690 1.0590 1.1555 1.0748 1.0706 1.0565 1.0594 2.0550 6.9285 6.1985 1.0656 1.0348 1.0351 1.0371 1.0356 1.0369 1.0358 1.0557 1.0589 1.0652 1.0920 1.0977 1.0968 1.1003 1.1067 1.0994 1.0991 1.0996 1.1002 1.1011 1.0999 1.0986 1.0984 1.0964 1.0923 1.0986 1.0993 1.0913 1.0893 1.0939 1.0652
irintensity: 0.1408 0.1098 0.0981 0.2976 0.0632 0.1964 0.5207 1.0701 0.3010 0.4034 0.4472 0.3583 9.0713 3.5040 0.4805 3.6591 3.6313 0.0124 2.0389 1.1572 0.0614 0.1545 0.0795 0.2878 1.5579 0.6781 1.4098 0.7019 6.2929 4.0821 18.5497 137.2991 3.7664 9.0764 0.1531 2.1944 27.2086 0.9311 3.9189 3.4530 1.9027 3.5923 1.4028 0.4791 0.6368 0.9246 5.5633 46.3043 2.0283 24.2456 14.7932 6.2868 14.5380 5.6100 14.8649 13.3278 0.1769 8.6880 3.3121 20.1980 10.0875 17.7289 5.1233 2.4767 6.1994 4.7034 72.8283 7.8109 0.0861 18.0329 13.0646 12.4914 3.9020 12.4187 95.8652 86.1404 11.8040 61.3198 13.5307 6.0648 155.8663 48.3660 25.4047 2.4492 43.3184 15.9316 39.9632 3.4872 1.3273 1.8445 19.9977 2.7829 0.6757 20.4932 2.9820 30.8981 5.1523 15.7675 44.8588 15.1777 11.0802 10.5989 2.4532 7.5680 68.7993 3.0292 10.1235 14.1578 5.1775 11.0699 4.2082 2.7510 11.2667 2.1343 17.9260 10.7738 15.0303 15.4139 4.3492 120.6721 0.7727 13.0642 38.2662 25.0241 29.1691 52.5112 24.8064 27.3560 28.6645 24.9749 35.8431 30.9786 10.7814 18.2852 21.5620 16.4204 37.7279 4.8175 7.4700 34.8975 35.1955 82.7842 41.7332 101.7680 17.0917 11.3969 47.2538 16.6842 23.0834 23.8504 20.3370 11.7980 13.3463
temp: 298.150 k
press: 1.00000 atm
elementType: 8 8 7 6 6 6 6 6 6 6 6 6 6 6 6 6 6 6 6 6 6 6 1 1 1 1 1 1 1 1 1 1 1 1 1 1 1 1 1 1 1 1 1 1 1 1 1 1 1 1 1 1 1
symmnumber: 1
zpe: 1211066.3 jmol-1
zpe.correction: 0.461271 hartree
zpe.thermalcorrener: 0.486111 hartree
zpe.thermalcorrenthalpy: 0.487055 hartree
zpe.thermalcorrgfe: 0.406104 hartree
zpe.sumelectzpe: -946.072076 hartree
zpe.sumelectthermal: -946.047236 hartree
zpe.sumelectthermalent: -946.046292 hartree
zpe.sumelectthermalfe: -946.127243 hartree
dipole: 0.0383 -2.2704 -0.4720
dipole: 2.3192
quadrupole: -124.8853 -146.8464 -128.9613
quadrupole: -0.9680 -2.1459 -1.5057
quadrupole: 8.6790 -13.2821 4.6030 -0.9680 -2.1459 -1.5057
hfenergy: -946.5333467 hartree
pointgroup: C01 [X(C19H31N1O2)]
dipole: -0.2094964 -0.4138942 -0.7857367 debye
polarizability: 260.1162523|-19.8333677|207.4133203|-34.7250478|3.2371055|190.637434 unknown
InChI: InChI=1S/C19H31NO2/c1-14-7-8-17(15(2)11-14)22-13-16(21)12-20-18(3,4)9-10-19(20,5)6/h7-8,11,16,21H,9-10,12-13H2,1-6H3
charge 0 multiplicity 1
53 atoms
O  0.041734 1.542129 2.882329
O  1.236999 0.278776 0.692386
N  -2.48652 0.513424 0.224053
C  -2.407605 0.486698 -1.286072
C  -3.905114 0.382636 0.696885
C  -3.822434 -0.042765 -1.704232
C  -4.482802 -0.548247 -0.401568
C  -1.544755 1.340374 0.991817
C  -2.148659 1.880238 -1.934176
C  -1.289859 -0.485604 -1.745289
C  -4.68265 1.737551 0.735606
C  -3.986373 -0.277583 2.093081
C  -0.71139 0.573933 2.063263
C  0.241055 -0.474808 1.48399
C  2.322735 -0.428283 0.134856
C  3.271708 0.369981 -0.568609
C  2.485912 -1.826824 0.239464
C  4.379111 -0.283341 -1.14961
C  3.610691 -2.444818 -0.355978
C  3.07708 1.868911 -0.677508
C  4.576132 -1.688236 -1.057607
C  5.788053 -2.345445 -1.696709
H  -3.742684 -0.833576 -2.470416
H  -4.418725 0.778516 -2.143296
H  -5.586232 -0.512947 -0.439364
H  -4.17721 -1.589274 -0.18757
H  -0.824426 1.822954 0.306058
H  -2.053166 2.163352 1.538326
H  -1.121427 2.242841 -1.742091
H  -2.269609 1.810018 -3.031395
H  -2.85958 2.636692 -1.556289
H  -0.305689 -0.167539 -1.356487
H  -1.4958 -1.508757 -1.381793
H  -1.224187 -0.51378 -2.84977
H  -5.70305 1.585345 1.134054
H  -4.177235 2.470039 1.391983
H  -4.77189 2.184251 -0.270251
H  -5.036004 -0.532558 2.33097
H  -3.388096 -1.206214 2.116291
H  -3.623457 0.399026 2.889073
H  -1.38598 0.071428 2.775038
H  -0.310048 -1.183501 0.838015
H  0.757269 -1.016006 2.300681
H  0.824358 1.826493 2.340599
H  1.753274 -2.440369 0.771445
H  5.115064 0.324075 -1.692751
H  3.731133 -3.531288 -0.269917
H  3.066357 2.34692 0.320374
H  3.883903 2.330134 -1.272101
H  2.10891 2.114688 -1.152674
H  5.822468 -2.159073 -2.786915
H  6.731905 -1.954885 -1.270842
H  5.780101 -3.438593 -1.544161
