program: Gaussian 09
title: 000218970
version: EM64L-G09RevD.01
frameworkgroup: C1[X(C19H31NO2)]
method: RPBEPBE
basis: SDD
operation: Freq
keyword: #p
keyword: freq=noraman
keyword: PBEPBE/SDD
title: #p freq=noraman PBEPBE/SDD
converged: YES YES NO NO
title: Mulliken charges:
elementType: O O N C C C C C C C C C C C C C C C C C C C H H H H H H H H H H H H H H H H H H H H H H H H H H H H H H H
charge: -0.445645 -0.337933 -0.233308 0.374948 0.400787 -0.532322 -0.508365 -0.386854 -0.756529 -0.747865 -0.743848 -0.754546 -0.143561 -0.335549 0.282097 0.111015 -0.370881 0.385972 -0.812165 -0.233219 -0.454469 -0.816166 0.225222 0.219578 0.217025 0.216866 0.204180 0.214951 0.210625 0.221851 0.222847 0.246325 0.210714 0.202540 0.212248 0.216870 0.222118 0.212130 0.217224 0.217885 0.235064 0.234355 0.234974 0.347975 0.252007 0.222499 0.250930 0.231766 0.222779 0.231005 0.228539 0.226428 0.228888
chargesum: 0.00000
title: Mulliken charges with hydrogens summed into heavy atoms:
elementType: O O N C C C C C C C C C C C C C C C C C C C
charge: -0.097670 -0.337933 -0.233308 0.374948 0.400787 -0.087522 -0.074475 0.032276 -0.101206 -0.088285 -0.092612 -0.107307 0.091503 0.133780 0.282097 0.111015 -0.118875 0.385972 -0.106969 -0.010440 -0.223465 -0.132311
polarizability: 2.65485542e+02 -2.40754914e+01 1.81588618e+02 -1.63840901e+00 4.19078791e+00 2.06880098e+02
1716.lowfreq: -14.9752 -11.0861 -8.4068 -0.0004 0.0004 0.0007 10.4593 17.1430 23.0807
frequency: -1.9859 16.9275 22.4635 35.3208 48.6168 68.2552 89.9107 114.6608 127.1701 146.1298 153.4872 153.9334 177.3599 193.5728 226.8568 228.7402 249.4654 252.8757 274.5394 278.2808 287.1041 300.3081 305.1334 307.9051 312.3634 319.8826 343.5184 359.9822 394.8970 409.0032 420.3759 427.2876 458.2901 476.8199 501.2922 507.0745 511.9745 515.6383 552.9159 562.4099 584.0245 601.2163 689.8883 710.9327 715.7199 735.6352 775.5087 801.1828 817.1088 830.8379 839.6450 864.0405 870.2012 891.9763 904.0836 915.9662 921.2793 932.6996 940.1481 958.1066 960.4833 967.6338 984.2436 987.9049 1008.1916 1023.0657 1024.9045 1025.4734 1051.5208 1068.8200 1071.2595 1091.1596 1096.6356 1108.9295 1123.9822 1166.9423 1173.1389 1183.0789 1193.1482 1194.6240 1197.2940 1216.5291 1236.1678 1238.3156 1240.9644 1258.8684 1262.8464 1267.7344 1275.1279 1309.8181 1319.1710 1327.6296 1352.1483 1361.5188 1363.7605 1371.8405 1380.6160 1382.3705 1383.5122 1386.5413 1390.4417 1401.9768 1436.2066 1450.9739 1455.5701 1456.5246 1460.3157 1461.3827 1463.8605 1466.4322 1471.5498 1472.2397 1473.9402 1476.2613 1481.6767 1483.0776 1485.5585 1486.8214 1488.7067 1493.8914 1592.9996 1609.5665 2946.9609 2968.8419 2970.2484 2970.7232 2972.7064 2973.2700 2978.0000 2984.6657 2997.4700 3003.9921 3039.8720 3042.8815 3047.6118 3053.9776 3054.9475 3060.5876 3062.1849 3066.7788 3068.1390 3071.3230 3076.5080 3078.5069 3080.1657 3080.8895 3084.8035 3085.5749 3109.9643 3125.7811 3147.2459 3171.5801 3529.5523
redmass: 3.2876 3.8701 3.9418 1.1141 2.8080 4.4171 3.6336 4.2495 3.3146 1.3646 2.1648 2.1554 3.8386 1.0601 2.1164 1.7491 2.0728 2.3894 2.4398 3.6031 1.1859 1.9023 1.4926 2.4030 1.6033 3.1619 2.3756 2.2722 2.4676 2.1570 1.7022 1.4824 3.6587 2.2586 3.3648 3.1695 3.5760 4.7527 3.3281 3.8099 3.0119 4.1091 4.5425 3.8369 2.2773 2.2065 1.5917 4.7380 2.4461 2.8322 2.6312 2.2656 1.4577 1.8452 1.5714 2.3629 1.7164 1.6266 2.1024 1.6345 1.3247 2.2229 1.2737 1.4299 1.4901 1.8378 1.4344 1.8461 1.6225 2.0665 1.4413 2.4080 1.8869 2.2712 2.0272 2.3070 2.6075 1.2070 2.8040 3.4466 2.0018 1.7562 1.7554 1.6482 1.7019 2.0649 2.1595 2.9363 1.4372 1.3877 1.7419 1.2436 1.3479 1.3282 1.2210 1.3670 2.7854 1.2439 1.3359 1.2345 1.2749 1.2587 1.5945 1.0707 1.0717 1.0877 1.2806 1.3707 1.0700 1.2229 1.0637 1.0657 1.2328 1.0592 1.2190 1.0724 1.0856 1.1738 1.0656 1.0591 6.3128 6.8024 1.0658 1.0348 1.0381 1.0351 1.0414 1.0356 1.0357 1.0557 1.0583 1.0649 1.0919 1.0960 1.0952 1.1009 1.1064 1.0995 1.0992 1.0988 1.0997 1.1020 1.0986 1.0923 1.0995 1.0975 1.0986 1.0983 1.0961 1.0865 1.0934 1.0960 1.0651
irintensity: 0.1505 0.0591 0.1066 0.3233 0.0273 0.2890 0.3341 1.1576 0.2405 0.4709 0.7220 1.2944 8.3339 0.5537 4.9732 0.6426 5.6681 0.2897 1.4724 4.1235 0.0673 0.3856 0.0344 0.5363 0.0931 1.7630 1.2234 0.9187 1.4787 1.5288 26.1042 131.6363 6.3432 0.1876 4.5082 8.9136 12.3056 6.1555 0.5657 0.7118 2.0281 2.6695 2.4947 6.1820 10.8422 3.4536 62.9467 0.9363 1.9273 22.0274 12.7430 0.8901 0.6657 6.8654 0.4133 10.6910 1.5882 14.1129 26.5810 9.8200 1.3101 18.1147 3.5592 8.1568 5.4668 57.3223 11.6737 19.3906 1.9459 79.1221 18.2889 48.4199 54.3491 3.3592 8.7771 90.0516 62.0159 11.9055 26.5861 5.2614 18.7805 19.0435 130.9684 3.7981 16.0992 18.9872 34.6903 29.9522 2.9456 1.3809 22.1036 5.1935 0.1577 22.3903 2.1122 29.9725 13.5337 9.9660 40.4002 11.0551 11.8570 18.8371 55.2072 2.3313 2.4281 10.4440 3.2344 16.3550 37.2991 18.2837 1.3464 15.0995 13.6624 3.1771 16.6827 16.5766 30.2982 18.4560 9.6130 3.2839 63.8618 15.0052 38.6304 22.5152 44.7979 31.0170 19.6221 23.0339 29.6228 24.8896 35.9250 30.6377 11.0554 39.1932 2.5434 9.7442 40.3543 3.7573 4.6087 42.7826 52.6044 57.3422 23.5806 39.5287 78.7344 62.3740 13.6594 24.4979 12.1087 5.6706 32.3803 12.4699 14.1237
temp: 298.150 k
press: 1.00000 atm
elementType: 8 8 7 6 6 6 6 6 6 6 6 6 6 6 6 6 6 6 6 6 6 6 1 1 1 1 1 1 1 1 1 1 1 1 1 1 1 1 1 1 1 1 1 1 1 1 1 1 1 1 1 1 1
symmnumber: 1
zpe: 1210839.7 jmol-1
zpe.correction: 0.461184 hartree
zpe.thermalcorrener: 0.485113 hartree
zpe.thermalcorrenthalpy: 0.486057 hartree
zpe.thermalcorrgfe: 0.407918 hartree
zpe.sumelectzpe: -946.070790 hartree
zpe.sumelectthermal: -946.046861 hartree
zpe.sumelectthermalent: -946.045917 hartree
zpe.sumelectthermalfe: -946.124056 hartree
dipole: -0.1759 -2.1051 0.6012
dipole: 2.1963
quadrupole: -124.9748 -145.3225 -130.7217
quadrupole: -0.1077 -4.1327 5.1916
quadrupole: 8.6982 -11.6495 2.9513 -0.1077 -4.1327 5.1916
hfenergy: -946.5319741 hartree
pointgroup: C01 [X(C19H31N1O2)]
dipole: -0.2228395 -0.228668 -0.8029407 debye
polarizability: 255.9967881|-10.7388598|208.8185534|-33.945828|1.9708724|189.1389167 unknown
InChI: InChI=1S/C19H31NO2/c1-14-8-7-9-17(15(14)2)22-13-16(21)12-20-18(3,4)10-11-19(20,5)6/h7-9,16,21H,10-13H2,1-6H3
charge 0 multiplicity 1
53 atoms
O  0.122808 1.296196 2.951019
O  1.21703 -0.022392 0.74733
N  -2.469536 0.573724 0.254155
C  -2.391378 0.598211 -1.257107
C  -3.896512 0.550071 0.722291
C  -3.846159 0.208018 -1.692544
C  -4.548435 -0.288243 -0.408867
C  -1.462489 1.294677 1.046554
C  -2.016358 1.988077 -1.85408
C  -1.359408 -0.447605 -1.753175
C  -4.55142 1.965591 0.806482
C  -4.043485 -0.150274 2.092952
C  -0.713149 0.427129 2.102979
C  0.136012 -0.694375 1.499586
C  2.234488 -0.817949 0.1760
C  3.290652 -0.106613 -0.463143
C  2.214441 -2.232299 0.223971
C  4.352292 -0.85293 -1.049583
C  3.284108 1.410999 -0.503124
C  3.273614 -2.953391 -0.367009
C  4.33501 -2.270725 -0.995004
C  5.504853 -0.136777 -1.733137
H  -3.832782 -0.556319 -2.488947
H  -4.369388 1.094339 -2.096954
H  -5.644965 -0.159154 -0.443121
H  -4.330823 -1.358262 -0.233878
H  -0.695913 1.722873 0.374617
H  -1.896326 2.149626 1.608363
H  -0.962884 2.257918 -1.651618
H  -2.14078 1.967142 -2.952986
H  -2.663023 2.787102 -1.44911
H  -0.351977 -0.228325 -1.355251
H  -1.651866 -1.4619 -1.426105
H  -1.29493 -0.441537 -2.858105
H  -5.585272 1.891643 1.192359
H  -3.988676 2.626214 1.491876
H  -4.589299 2.452632 -0.183495
H  -5.113419 -0.31733 2.318192
H  -3.532349 -1.12972 2.082414
H  -3.625825 0.460705 2.914622
H  -1.439128 -0.027316 2.796353
H  -0.477768 -1.319021 0.824002
H  0.580942 -1.31334 2.302804
H  0.943175 1.50087 2.429637
H  1.393458 -2.768621 0.706983
H  3.510924 1.786292 -1.518018
H  2.30651 1.811896 -0.195535
H  4.052871 1.833891 0.173671
H  3.266563 -4.04844 -0.333292
H  5.157662 -2.835206 -1.448368
H  5.16474 0.427202 -2.623521
H  5.988572 0.595204 -1.058997
H  6.274594 -0.85418 -2.064036
