program: Gaussian 09
title: 000218964
version: EM64L-G09RevD.01
frameworkgroup: C1[X(C17H27NO2)]
method: RPBEPBE
basis: SDD
operation: Freq
keyword: #p
keyword: freq=noraman
keyword: PBEPBE/SDD
title: #p freq=noraman PBEPBE/SDD
converged: YES YES NO NO
title: Mulliken charges:
elementType: O O N C C C C C C C C C C C C C C C C C H H H H H H H H H H H H H H H H H H H H H H H H H H H
charge: -0.444818 -0.325876 -0.233692 0.374983 0.400286 -0.532179 -0.507799 -0.388374 -0.756589 -0.747878 -0.744006 -0.754099 -0.142852 -0.340443 0.407894 -0.345475 -0.394501 -0.221100 -0.196160 -0.257740 0.225001 0.220126 0.217019 0.216523 0.207757 0.215458 0.212176 0.221968 0.222734 0.243313 0.210221 0.203696 0.212347 0.216953 0.222397 0.212430 0.216768 0.217643 0.237291 0.235929 0.235193 0.348294 0.251330 0.247303 0.224182 0.227574 0.228793
chargesum: 0.00000
title: Mulliken charges with hydrogens summed into heavy atoms:
elementType: O O N C C C C C C C C C C C C C C C C C
charge: -0.096524 -0.325876 -0.233692 0.374983 0.400286 -0.087052 -0.074257 0.034840 -0.099711 -0.090648 -0.092308 -0.107259 0.094439 0.130678 0.407894 -0.094145 -0.147198 0.003082 0.031414 -0.028947
polarizability: 2.36839503e+02 -2.50535979e+01 1.65130114e+02 -3.63098104e+00 1.68864706e+00 1.77863327e+02
1716.lowfreq: -21.4401 -12.9702 -0.0005 -0.0004 0.0003 6.1966 20.9672 23.7484 35.6424
frequency: 18.7899 23.4061 35.3802 53.2580 78.9474 104.5606 117.0466 132.6971 151.7580 176.8635 203.9004 224.3538 236.5141 248.4518 255.7574 278.7072 291.9879 300.9062 305.7597 310.0711 344.6350 363.7565 392.5349 395.1883 407.0658 410.8344 420.9698 439.7454 477.5552 500.6079 501.7196 512.9023 555.2667 584.2678 609.5549 630.5221 690.9667 691.4059 733.3977 756.9704 795.8622 818.6522 822.8047 830.5415 850.0358 887.9859 891.3137 904.4939 907.7369 922.8488 929.6998 937.7260 953.9409 961.5125 964.0134 982.4053 984.0633 985.0842 1009.7274 1021.5392 1022.3328 1025.4300 1073.0972 1078.9924 1086.7537 1106.1316 1121.0506 1166.4485 1167.7759 1172.9601 1178.1269 1191.8998 1196.8046 1212.2870 1220.4644 1238.2135 1240.5080 1257.9130 1267.7236 1272.9825 1310.8719 1312.5153 1317.9810 1324.9340 1350.6444 1359.9774 1367.4056 1373.8289 1383.0476 1386.1196 1388.0982 1389.4561 1442.6010 1451.5167 1454.8082 1457.7687 1458.9382 1462.4351 1471.6877 1474.2079 1477.5760 1480.2943 1480.9408 1487.1770 1489.0847 1493.2020 1592.9179 1611.2803 2949.3920 2970.0854 2972.2819 2974.3436 2978.6421 2985.6593 2996.9609 3003.0437 3043.4956 3054.1762 3056.6717 3061.7544 3063.1274 3068.1611 3068.5247 3071.5857 3076.3079 3079.1142 3080.7718 3082.0112 3084.8743 3128.9673 3137.2830 3155.2745 3164.0884 3173.2286 3529.4801
redmass: 3.7610 4.9676 3.5462 2.9311 4.7662 4.4493 4.6353 3.3574 2.1861 3.8950 1.0792 1.4157 4.1472 2.0294 2.4611 2.3934 1.3563 1.4513 1.2199 2.3465 2.3573 2.2542 2.8448 2.9795 2.2204 2.7938 2.0627 1.3258 2.2279 3.9867 2.9049 3.8250 3.3275 3.0253 6.4294 4.2586 2.5307 3.3140 2.1399 1.6232 3.8664 2.4397 1.2983 2.8044 2.3842 1.5166 1.8022 1.7270 2.0960 1.7226 2.0034 2.0369 1.9671 1.3835 1.8900 1.3033 5.3745 1.2917 1.5206 1.8605 2.0576 1.8354 1.4492 1.7165 1.8233 2.2389 1.9913 2.0653 1.1496 2.5640 1.1770 2.9970 1.8087 2.2443 2.1169 1.8342 1.3097 2.0715 2.9032 1.4969 1.3451 1.3375 1.7439 1.2542 1.3120 1.3363 1.2269 1.2406 1.3361 1.2294 1.9826 1.9621 2.1315 1.1602 1.0931 1.0632 1.0768 1.0642 1.0593 1.0697 1.1293 1.0700 1.7703 1.0610 1.0786 1.0553 6.4654 6.2268 1.0655 1.0348 1.0351 1.0356 1.0360 1.0557 1.0587 1.0653 1.0918 1.1000 1.1067 1.0995 1.0990 1.1004 1.0984 1.1013 1.0994 1.0909 1.0996 1.0981 1.0987 1.0848 1.0889 1.0928 1.0955 1.1004 1.0652
irintensity: 0.2943 0.0928 0.1284 0.0616 0.2873 0.3709 1.0675 2.0514 0.3897 5.8063 0.6505 1.6106 1.8787 5.4765 0.0935 1.9170 0.0666 0.0635 0.1168 0.1940 1.4931 0.8324 1.9533 10.9207 2.0623 0.3366 11.4178 159.3282 0.2109 6.2395 11.5208 22.8484 0.6085 2.8805 0.7554 1.7704 24.7738 7.8005 1.2422 92.6704 5.7534 2.4346 2.7506 18.0100 13.8481 11.9946 10.4948 6.0408 13.0031 2.7137 37.8133 17.6814 10.1684 0.8874 11.6609 0.7639 1.2135 3.5183 8.3344 69.1509 22.2604 9.4111 13.8862 5.4162 21.5569 3.0119 1.7399 66.7216 26.2749 60.4118 49.7439 11.1953 7.3521 148.6166 120.1600 14.2483 4.3465 17.3885 38.0523 4.0774 3.0236 1.9116 19.2093 4.2926 0.1147 12.9723 4.1096 39.1462 37.1399 35.7688 8.8693 8.8932 8.0360 59.6618 31.6821 3.0918 3.1351 5.6968 9.0850 11.7084 4.0109 9.6385 70.4710 15.1752 9.9909 2.8820 23.0248 83.2209 39.3860 23.9358 29.7929 21.0442 28.3268 24.4858 36.8468 29.8354 8.0702 15.8647 33.2309 3.5528 5.1806 46.1523 37.6511 70.6000 32.0560 44.8458 53.3457 64.2574 16.4716 2.9672 11.1520 29.8993 23.4664 5.1594 13.5209
temp: 298.150 k
press: 1.00000 atm
elementType: 8 8 7 6 6 6 6 6 6 6 6 6 6 6 6 6 6 6 6 6 1 1 1 1 1 1 1 1 1 1 1 1 1 1 1 1 1 1 1 1 1 1 1 1 1 1 1
symmnumber: 1
zpe: 1068800.5 jmol-1
zpe.correction: 0.407085 hartree
zpe.thermalcorrener: 0.428313 hartree
zpe.thermalcorrenthalpy: 0.429257 hartree
zpe.thermalcorrgfe: 0.356722 hartree
zpe.sumelectzpe: -867.613991 hartree
zpe.sumelectthermal: -867.592763 hartree
zpe.sumelectthermalent: -867.591819 hartree
zpe.sumelectthermalfe: -867.664354 hartree
dipole: -0.4201 -2.1337 1.0231
dipole: 2.4033
quadrupole: -114.1871 -133.7450 -116.3963
quadrupole: -1.1600 -0.8612 3.3888
quadrupole: 7.2557 -12.3022 5.0465 -1.1600 -0.8612 3.3888
hfenergy: -868.0210756 hartree
pointgroup: C01 [X(C17H27N1O2)]
dipole: -0.4311392 -0.5873407 -0.6026345 debye
polarizability: 221.5027226|-21.0920403|183.4754967|-31.9957035|4.7758429|174.8547259 unknown
InChI: InChI=1S/C17H27NO2/c1-16(2)10-11-17(3,4)18(16)12-14(19)13-20-15-8-6-5-7-9-15/h5-9,14,19H,10-13H2,1-4H3
charge 0 multiplicity 1
47 atoms
O  0.842801 1.792449 2.362501
O  1.764204 0.12154 0.330255
N  -1.97686 0.546323 0.123265
C  -2.052034 0.308581 -1.370321
C  -3.348697 0.576426 0.734369
C  -3.524196 -0.189497 -1.575685
C  -4.075894 -0.463223 -0.158568
C  -0.923938 1.418321 0.665708
C  -1.800308 1.582217 -2.232934
C  -1.029874 -0.78042 -1.786476
C  -4.047825 1.970016 0.641453
C  -3.331855 0.126886 2.213759
C  -0.041708 0.77037 1.775426
C  0.782943 -0.426328 1.294296
C  2.733522 -0.748252 -0.199829
C  2.784408 -2.137961 0.07076
C  3.689812 -0.148339 -1.056447
C  3.803513 -2.919214 -0.522647
C  4.697697 -0.941214 -1.639803
C  4.762481 -2.331977 -1.376561
H  -3.556812 -1.084354 -2.221438
H  -4.122354 0.595547 -2.074297
H  -5.174696 -0.365558 -0.100524
H  -3.80074 -1.479972 0.178295
H  -0.243759 1.73041 -0.147761
H  -1.331039 2.352504 1.108407
H  -0.744161 1.908063 -2.196647
H  -2.037934 1.368091 -3.291747
H  -2.434459 2.423883 -1.901134
H  0.00223 -0.468531 -1.543927
H  -1.241862 -1.728343 -1.259323
H  -1.078268 -0.968203 -2.876106
H  -5.036345 1.939836 1.136645
H  -3.44957 2.751514 1.145746
H  -4.200117 2.279153 -0.407364
H  -4.366772 -0.023129 2.57399
H  -2.783049 -0.82602 2.320247
H  -2.862704 0.884096 2.868989
H  -0.67694 0.436071 2.611239
H  0.129654 -1.16969 0.800788
H  1.325142 -0.886322 2.143141
H  1.590486 1.926605 1.722544
H  2.048605 -2.613353 0.72557
H  3.626718 0.927403 -1.249097
H  3.842186 -3.994098 -0.312519
H  5.435366 -0.472666 -2.300811
H  5.5479 -2.944742 -1.830923
