program: Gaussian 09
title: 000019314
version: EM64L-G09RevD.01
frameworkgroup: C1[X(C9H10O3)]
method: RPBEPBE
basis: SDD
operation: Freq
keyword: #pfreq=noraman
keyword: PBEPBE/SDD
title: #p freq=noraman PBEPBE/SDD
converged: YES YES NO NO
title: Mulliken charges:
elementType: O O O C C C C C C C C C H H H H H H H H H H
charge: -0.318403 -0.259501 -0.433008 -0.065850 -0.330441 -0.339388 0.258284 0.239705 -0.369680 -0.369862 -0.225280 -0.223035 0.261410 0.219794 0.230309 0.196139 0.214212 0.245913 0.250487 0.230151 0.230493 0.357551
chargesum: 0.00000
title: Mulliken charges with hydrogens summed into heavy atoms:
elementType: O O O C C C C C C C C C
charge: -0.318403 -0.259501 -0.075457 0.195560 0.119662 0.070963 0.258284 0.239705 -0.123767 -0.119374 0.004871 0.007458
polarizability: 1.43463590e+02 9.39766189e+00 1.08156272e+02 2.78635668e+00 -2.70205765e+00 5.68719968e+01
1716.lowfreq: -10.4139 -0.0006 0.0004 0.0008 5.7855 10.8705 67.6938 83.9685 137.8393
frequency: 67.6850 83.9647 137.8293 172.6379 222.8957 288.7584 313.2891 373.7843 443.1946 448.7598 460.3735 478.2149 489.1276 543.8998 565.9886 636.1998 710.6209 716.2227 754.5019 798.6481 847.1781 864.9329 921.9225 932.4026 952.5173 967.4043 999.3108 1024.8509 1057.9668 1075.4310 1084.7830 1111.7796 1161.5449 1162.5634 1194.1833 1216.4684 1237.3044 1264.1295 1275.5303 1317.5357 1345.9506 1362.8034 1388.1256 1394.2164 1443.2090 1455.7244 1464.8460 1475.2941 1592.5176 1612.4995 2964.5629 2992.4134 3013.3346 3079.4871 3098.2183 3138.7021 3151.5351 3163.8242 3176.2026 3548.2428
redmass: 6.1149 3.6455 3.5706 3.2349 3.3514 5.0094 4.2562 4.4049 1.2476 3.0415 3.0920 6.0980 3.8040 4.4147 4.7409 4.2385 4.3041 5.2619 1.2407 4.1082 1.4025 4.6801 1.5847 1.3702 8.9065 1.2952 5.0968 2.0227 2.5690 2.5905 2.7444 2.0360 1.4498 1.4343 1.2408 1.2555 2.4990 1.4385 1.3998 1.2864 1.1866 1.4905 2.3053 1.8944 2.2253 1.1508 1.1599 2.5157 7.5461 7.0862 1.0682 1.0685 1.0804 1.0960 1.1005 1.0852 1.0898 1.0948 1.1007 1.0655
irintensity: 0.8222 6.0236 5.6983 0.2896 5.9116 0.6943 8.8896 6.7093 187.8994 2.0253 2.7558 5.0507 15.6046 0.7702 2.5204 2.9848 0.0912 12.3377 111.7278 29.5975 0.0549 43.7179 7.4918 6.1185 64.4781 0.0174 61.3213 12.1723 44.0579 20.6898 16.6311 1.2530 4.0890 8.3017 32.4852 23.8961 197.3642 16.4470 22.5243 8.9725 27.7149 14.3056 32.9303 12.5008 5.5185 6.9787 9.4649 166.3702 21.7148 3.7267 44.0851 38.2585 47.8607 16.2174 30.0194 0.9913 11.7823 14.5052 12.9364 9.6838
temp: 298.150 k
press: 1.00000 atm
elementType: 8 8 8 6 6 6 6 6 6 6 6 6 1 1 1 1 1 1 1 1 1 1
symmnumber: 1
zpe: 456004.8 jmol-1
zpe.correction: 0.173683 hartree
zpe.thermalcorrener: 0.183886 hartree
zpe.thermalcorrenthalpy: 0.184830 hartree
zpe.thermalcorrgfe: 0.137818 hartree
zpe.sumelectzpe: -573.706146 hartree
zpe.sumelectthermal: -573.695943 hartree
zpe.sumelectthermalent: -573.694999 hartree
zpe.sumelectthermalfe: -573.742011 hartree
dipole: -0.4539 0.8603 0.9752
dipole: 1.3773
quadrupole: -71.4867 -66.8700 -72.9260
quadrupole: 8.8203 3.7865 -0.4407
quadrupole: -1.0592 3.5576 -2.4984 8.8203 3.7865 -0.4407
hfenergy: -573.8798287 hartree
pointgroup: C01 [X(C9H10O3)]
dipole: 0.1776175 0.3386811 -0.3839092 debye
dipolederiv: -1.6214682 0.1069285 0.0121106 0.0954341 -0.3808893 0.0131252 -0.0667676 -0.0060603 -0.278438 -1.1064152 0.395744 -0.0561856 0.5032761 -0.7102422 0.064814 0.0234692 -0.0143267 -0.2713699 -0.4788777 -0.187671 -0.1309938 -0.3312185 -0.6512175 0.1047048 -0.1380753 0.0754704 -0.5060041 0.4848004 -0.1686823 -0.0938529 -0.5302176 0.2217436 0.0553033 -0.1974077 0.0944541 0.2832533 0.6706999 -0.2303507 0.1144783 0.1514999 0.1452063 0.0072156 0.1346966 -0.032598 0.3447567 0.3480242 0.1004782 0.0022755 0.1077546 0.5239592 -0.1267326 0.065744 -0.0743089 0.4040296 1.2374123 -0.0353338 0.0140229 0.4421698 -0.0996138 -0.0121487 0.1629641 -0.0675533 0.0345885 0.4179619 -0.3963444 0.0065593 -0.9157836 0.5876881 -0.0629695 -0.1402634 0.006559 0.0254047 -0.1453933 -0.013541 0.0165887 0.0823411 0.049302 0.0296644 0.0478863 0.0279224 -0.1592205 -0.0924886 0.1440186 0.0081881 0.0296357 0.0202189 0.0328304 -0.0119727 0.057225 -0.1614301 -0.0344761 -0.003274 0.0069221 -0.0676523 0.0276627 0.0224517 0.0023132 0.0279569 -0.1761033 0.0280626 -0.0086907 0.0202065 0.0722632 -0.0173567 0.0228389 0.0268142 0.0209477 -0.1730363 0.0106966 0.0088485 -0.0392561 0.1004455 0.0206124 0.0051592 0.0540902 -0.0277769 -0.124812 -0.0188435 0.0242936 -0.0045347 -0.0738245 0.0922367 -0.0515627 -0.085387 0.051826 -0.1482946 -0.0227649 0.0975555 0.0050553 0.1237617 -0.0259227 -0.0267265 0.0282945 -0.05655 0.0811934 0.0571828 -0.0359906 0.0418188 -0.0431653 0.0039488 0.0291478 -0.0300022 0.0627147 -0.2116064 -0.0238069 0.0811838 0.0294277 0.079075 -0.0508512 -0.0174741 0.0614387 -0.054284 0.0694495 0.0717622 -0.0757374 -0.0153707 -0.0548545 -0.0365009 -0.0242591 -0.0110522 -0.021922 0.165994 0.0850413 -0.0327038 -0.0080045 -0.0530278 -0.0464477 -0.0260811 -0.0098359 -0.0223269 0.1677785 -0.0060667 0.1026718 0.000468 0.1092304 -0.0347111 -0.0159398 -0.0027292 -0.0209784 0.1656174 -0.1223922 -0.0291486 -0.025364 -0.0324689 0.0844249 -0.0115411 -0.0265644 -0.0168626 0.1637984 0.2613491 0.1557459 0.0954404 0.205326 0.2767496 -0.0118201 0.1123465 -0.0095282 0.3044514 unknown
polarizability: 143.6215803|-9.0112117|107.976656|3.425893|2.4380904|56.8936226 unknown
InChI: InChI=1S/C9H10O3/c10-5-7-6-11-8-3-1-2-4-9(8)12-7/h1-4,7,10H,5-6H2
charge 0 multiplicity 1
22 atoms
O  -0.950092 -0.792902 -0.2242
O  0.065611 1.924303 0.106559
O  -3.63773 -1.33407 0.36516
C  -1.821731 0.330683 0.227637
C  -1.302042 1.63879 -0.378321
C  -3.231469 -0.060413 -0.225642
C  0.43571 -0.52215 -0.111157
C  0.925961 0.801721 0.057257
C  1.333569 -1.606269 -0.173618
C  2.311164 1.027412 0.18893
C  2.721284 -1.376434 -0.053953
C  3.208964 -0.060379 0.137059
H  -1.77038 0.375621 1.333703
H  -1.292481 1.573436 -1.484555
H  -1.908795 2.501554 -0.059382
H  -3.26334 -0.103716 -1.335373
H  -3.967955 0.679947 0.129354
H  0.930572 -2.615215 -0.307443
H  2.661981 2.055485 0.322483
H  3.416069 -2.221046 -0.10231
H  4.283932 0.120161 0.238871
H  -2.923301 -1.99352 0.166242
