program: Gaussian 09
title: 000218949
version: EM64L-G09RevD.01
frameworkgroup: C1[X(C16H20N2O2S)]
method: RPBEPBE
basis: SDD
operation: Freq
keyword: #p
keyword: freq=noraman
keyword: PBEPBE/SDD
title: #p freq=noraman PBEPBE/SDD
converged: NO YES NO NO
title: Mulliken charges:
elementType: S O O N N C C C C C C C C C C C C C C C C H H H H H H H H H H H H H H H H H H H H
charge: 0.131454 -0.280220 -0.212899 0.044938 -0.415918 0.302639 -0.440572 -0.420736 -0.431229 -0.372295 -0.327069 -0.704639 -0.175900 0.138293 0.254657 -0.346884 -0.349132 0.446981 -0.375110 -0.399523 -0.803527 0.197186 0.215156 0.208666 0.257733 0.236147 0.240320 0.197248 0.198466 0.217202 0.206031 0.301710 0.266638 0.329257 0.271358 0.224986 0.235755 0.234829 0.241149 0.227512 0.229341
chargesum: 0.00000
title: Mulliken charges with hydrogens summed into heavy atoms:
elementType: S O O N N C C C C C C C C C C C C C C C C
charge: 0.131454 -0.280220 -0.212899 0.044938 -0.086661 0.302639 -0.028230 0.045663 0.045238 0.023419 0.096165 -0.136291 -0.175900 0.138293 0.254657 -0.075526 -0.124145 0.446981 -0.139355 -0.164694 -0.105525
polarizability: 3.07570583e+02 3.72064896e+00 2.05315094e+02 -3.83370283e+00 1.61643278e+01 1.45465101e+02
1716.lowfreq: -42.9418 -22.9073 -6.2103 -0.0010 -0.0005 0.0011 5.7218 16.3839 21.7529
frequency: -42.7817 13.1019 20.0584 37.7132 42.4145 62.3530 91.9077 105.8666 130.0556 166.1711 191.5344 221.6426 233.9482 253.7779 268.6053 286.2173 315.6474 331.4931 340.5232 393.0623 405.5117 410.0664 441.2050 448.8313 455.8941 485.2639 525.9077 539.5561 562.3236 570.1679 615.0395 619.4756 623.8681 635.9671 642.8045 688.1385 706.7866 743.4433 764.9241 801.9990 826.8688 833.7028 843.6191 859.8031 861.0346 907.6949 927.0139 932.3268 958.7059 959.6095 978.7046 984.7727 992.0395 1002.2056 1014.9666 1030.3866 1040.6887 1047.7627 1069.2172 1094.6217 1107.5069 1126.6184 1148.8338 1165.0559 1172.4006 1177.2269 1194.4461 1202.4369 1225.4279 1227.2636 1242.6049 1267.4806 1273.7782 1295.0864 1309.7783 1335.0174 1344.3777 1345.8875 1351.3557 1362.4311 1370.2856 1397.0793 1406.7042 1427.0044 1440.0985 1443.6235 1454.6265 1455.4719 1456.9102 1469.6345 1471.3908 1471.5780 1504.2906 1573.3377 1617.9248 1622.9080 1683.5824 2977.3290 2978.2128 2984.8021 2994.1944 2999.2314 3004.4570 3039.5833 3044.1753 3048.3833 3059.3348 3066.0000 3070.7138 3078.4451 3088.9780 3116.4863 3123.4722 3128.3981 3141.0647 3161.6935 3528.2162
redmass: 1.0209 4.0501 5.0709 5.4562 4.8853 5.1069 4.8351 4.3261 4.0757 4.1678 2.8924 3.9198 3.4466 3.6807 5.3000 3.1376 4.8040 2.3797 2.8262 3.3290 2.8757 3.4381 3.0634 4.1956 4.0848 3.5267 4.6090 2.2810 5.4627 6.1868 2.2919 5.8668 1.6678 3.8765 4.2163 4.5063 4.4350 2.8946 3.8572 4.6836 1.6805 1.6016 2.7338 1.3258 2.1185 1.6935 3.3933 2.8808 1.9286 1.3778 2.2621 1.4490 1.3995 3.7692 2.5777 2.8318 2.6581 1.5874 1.8886 2.0868 1.9031 1.3220 1.5149 2.0457 1.8295 1.6588 1.1689 1.5307 3.5272 1.6277 2.4205 1.4298 1.2288 1.2215 1.2917 1.3390 1.5782 1.5452 1.3444 1.3063 4.7798 1.2229 3.5311 1.0853 1.1011 1.0945 1.6474 1.1209 1.0953 1.0991 1.0888 1.0616 2.5896 5.9954 5.9509 6.1256 10.3223 1.0389 1.0599 1.0599 1.0632 1.0622 1.0594 1.0993 1.0605 1.0996 1.0947 1.1028 1.1004 1.1048 1.1000 1.0869 1.1089 1.0895 1.0962 1.0955 1.0766
irintensity: 0.5076 1.0535 0.8996 0.9140 0.7921 1.4696 2.7324 1.6416 1.3813 0.5152 4.3567 5.4021 3.3896 4.2207 4.6092 1.1826 4.4045 5.8338 2.1773 5.8016 0.6513 5.7353 2.5416 6.8335 7.0981 9.9757 7.5057 14.7465 32.1156 8.3423 10.0192 6.4636 47.3102 5.9455 9.6012 21.2006 38.4222 28.3971 51.6364 9.8405 1.7642 25.9485 7.5563 12.2226 27.7722 8.8195 54.0071 14.5220 20.4444 1.1112 103.5157 7.5525 0.6751 46.1078 54.8484 14.5420 47.2016 24.1778 5.3211 14.7165 73.5223 22.5185 44.4867 42.1012 30.0927 15.1221 91.1971 29.8130 14.6848 39.1198 218.7974 16.0104 0.5100 35.6012 3.5137 0.8901 5.7039 7.1173 9.6720 0.5273 1.4907 11.1254 9.5117 8.2936 22.4317 27.0934 734.7486 31.9204 30.4739 30.2595 24.8493 23.4869 12.3879 18.4194 97.0382 22.9733 416.5882 30.8269 41.4859 26.4538 31.0005 46.2711 30.9495 44.5147 17.4279 18.0588 21.0103 32.1889 22.1442 55.7794 16.1218 16.5403 6.0078 18.8411 16.8402 5.4352 15.6614
temp: 298.150 k
press: 1.00000 atm
elementType: 16 8 8 7 7 6 6 6 6 6 6 6 6 6 6 6 6 6 6 6 6 1 1 1 1 1 1 1 1 1 1 1 1 1 1 1 1 1 1 1 1
symmnumber: 1
zpe: 874073.3 jmol-1
zpe.correction: 0.332917 hartree
zpe.thermalcorrener: 0.352221 hartree
zpe.thermalcorrenthalpy: 0.353165 hartree
zpe.thermalcorrgfe: 0.282506 hartree
zpe.sumelectzpe: -1278.162330 hartree
zpe.sumelectthermal: -1278.143026 hartree
zpe.sumelectthermalent: -1278.142082 hartree
zpe.sumelectthermalfe: -1278.212741 hartree
dipole: -2.2188 1.4821 0.7244
dipole: 2.7648
quadrupole: -100.8149 -130.3290 -131.5108
quadrupole: -0.1922 -5.4933 1.2720
quadrupole: 20.0700 -9.4441 -10.6259 -0.1922 -5.4933 1.2720
hfenergy: -1278.4952469 hartree
pointgroup: C01 [X(C16H20N2O2S1)]
dipole: -0.8828351 -0.5949598 -0.2232748 debye
polarizability: 307.2452713|-5.4262485|208.521267|6.5994785|8.2662993|142.5842394 unknown
InChI: InChI=1S/C16H20N2O2S/c1-12-4-6-13(7-5-12)14(19)17-15-18-16(9-11-21-15)8-2-3-10-20-16/h4-7,17H,2-3,8-11H2,1H3
charge 0 multiplicity 1
41 atoms
S  1.365771 -2.885853 0.757865
O  3.872058 -0.157873 -1.048811
O  -0.591353 1.426882 0.796749
N  1.831483 -0.119425 0.208497
N  -0.407358 -0.883025 0.328312
C  3.302644 -0.215096 0.321047
C  3.78142 1.006326 1.14556
C  3.449346 2.334321 0.429112
C  3.844553 -1.541436 0.894497
C  4.035752 2.331253 -1.003128
C  3.541835 1.094663 -1.773207
C  3.194534 -2.776532 0.257971
C  0.990681 -1.069613 0.388834
C  -1.121658 0.334442 0.461214
C  -2.601216 0.207675 0.199881
C  -3.452276 1.192708 0.763388
C  -3.177299 -0.813047 -0.60113
C  -5.429723 0.119455 -0.239028
C  -4.842955 1.143274 0.552392
C  -4.571532 -0.853398 -0.813508
C  -6.925696 0.089375 -0.491855
H  4.876845 0.910523 1.284089
H  3.304021 0.975302 2.14277
H  3.852996 3.184773 1.009656
H  2.350614 2.447858 0.383217
H  3.705715 -1.559263 1.991261
H  4.929321 -1.558354 0.682922
H  3.7324 3.244953 -1.550687
H  5.143067 2.318514 -0.958659
H  2.446604 1.147401 -1.92686
H  4.047595 0.979936 -2.746796
H  3.247222 -2.729664 -0.841028
H  3.643161 -3.714716 0.619599
H  -0.961987 -1.737673 0.237555
H  -2.996549 1.989432 1.360398
H  -2.548108 -1.558866 -1.102673
H  -5.486048 1.907437 1.005165
H  -4.998701 -1.644414 -1.441345
H  -7.189883 0.717103 -1.365178
H  -7.282813 -0.933597 -0.702577
H  -7.490185 0.47984 0.373013
