program: Gaussian 09
title: 000218916
version: EM64L-G09RevD.01
frameworkgroup: C1[X(C17H22N2OS)]
method: RPBEPBE
basis: SDD
operation: Freq
keyword: #p
keyword: freq=noraman
keyword: PBEPBE/SDD
title: #p freq=noraman PBEPBE/SDD
converged: YES YES NO NO
title: Mulliken charges:
elementType: S O N N C C C C C C C C C C C C C C C C C H H H H H H H H H H H H H H H H H H H H H H
charge: 0.113143 -0.258911 -0.029916 -0.050291 -0.332179 -0.378411 -0.374164 -0.363290 -0.662286 -0.703056 -0.397806 -0.289707 0.098962 0.409545 -0.054115 -0.333716 -0.274698 -0.392477 -0.313202 -0.254396 -0.219936 0.211784 0.208090 0.194844 0.214252 0.233566 0.240416 0.190987 0.196207 0.283214 0.252013 0.262096 0.257421 0.213845 0.211904 0.223663 0.220013 0.253549 0.244334 0.232968 0.256707 0.229152 0.229883
chargesum: 0.00000
title: Mulliken charges with hydrogens summed into heavy atoms:
elementType: S O N N C C C C C C C C C C C C C C C C C
charge: 0.113143 -0.258911 -0.029916 -0.050291 0.087694 0.030685 0.099818 0.023904 -0.127059 -0.183540 0.027943 0.153970 0.098962 0.409545 -0.054115 -0.080167 -0.030365 -0.159509 -0.056495 -0.025243 0.009947
polarizability: 3.10976087e+02 -1.84325775e+01 2.21464122e+02 -3.13463772e+00 -7.63509519e+00 1.39859184e+02
1716.lowfreq: -5.8100 -0.0017 -0.0012 0.0002 4.4213 5.7889 15.8400 23.3766 30.6442
frequency: 15.2365 22.0461 30.3489 41.9679 62.1462 76.7370 88.0197 109.0387 123.7017 134.0184 155.4813 162.8240 179.6284 186.3950 225.6634 306.3941 314.5281 354.2523 375.5757 402.0682 423.8585 444.8768 462.4500 480.2554 500.9513 515.7385 518.0916 538.5860 547.2583 618.7827 633.3692 666.5763 676.1177 716.7068 732.5414 757.7887 763.7527 766.7391 788.7874 807.5857 833.2548 838.4179 875.8198 882.0914 895.3859 906.9895 909.1143 924.5891 954.3536 957.7812 967.5546 978.5506 992.1341 995.3440 1018.7814 1021.1725 1039.6882 1053.9453 1080.8166 1094.8610 1101.8380 1105.3263 1121.5276 1139.9787 1146.1380 1158.9645 1166.7494 1203.3779 1223.3407 1226.6898 1232.8600 1245.6372 1251.1937 1254.0947 1264.8834 1274.4442 1287.7111 1296.6568 1302.2009 1305.7672 1310.9745 1335.0099 1349.6776 1366.8315 1373.6064 1380.8201 1405.7309 1422.8925 1451.6240 1455.7231 1457.6056 1465.1557 1466.6872 1469.2206 1476.0914 1482.6172 1489.6050 1505.8082 1553.1682 1600.4847 1625.6036 2906.8691 2958.1352 2979.7523 2988.7711 2997.1598 3001.5584 3008.2959 3022.0514 3032.5769 3039.0445 3052.6546 3059.3839 3071.8562 3078.9662 3109.2356 3120.8988 3134.6482 3136.6910 3148.1369 3155.0154 3168.9744 3182.1078
redmass: 5.3231 4.8925 4.3221 5.7173 2.1545 2.8962 4.4227 3.6770 1.9999 3.1478 3.0905 3.2028 4.3228 3.6420 3.5253 5.7434 3.9350 2.9506 3.2480 3.4578 3.7282 3.1388 3.6513 3.0386 5.5356 5.0978 6.5344 4.4933 3.3722 7.1763 4.9472 3.0414 3.2967 7.0437 1.0699 5.8252 1.3343 1.1351 3.3260 2.5937 1.4418 1.2237 1.7576 1.6604 5.8081 1.6399 3.1812 6.6257 1.2467 1.3477 5.3998 1.3567 1.3282 1.9435 2.1508 2.0738 3.7203 2.5723 2.1760 2.3111 1.9317 1.8857 1.4596 1.2112 1.4610 1.2219 1.0987 1.3043 1.3340 1.7517 1.2619 2.1225 1.2515 1.4380 2.4356 1.1815 1.0849 1.6482 1.6556 1.3270 1.4594 1.3827 1.4490 1.8937 1.4859 3.0597 4.9678 2.2956 1.0919 1.0823 2.6707 1.0958 1.0747 1.1163 1.1115 1.1064 1.1067 3.6909 7.6614 6.3763 6.8118 1.0682 1.0587 1.0607 1.0598 1.0566 1.0983 1.0607 1.0922 1.0582 1.1029 1.1040 1.0576 1.1071 1.1030 1.1094 1.0872 1.0890 1.0901 1.1119 1.0947 1.0996 1.0966
irintensity: 0.3452 0.2846 0.4022 1.2404 0.0801 1.9850 0.5228 0.0976 0.2815 1.4126 1.7088 0.5622 1.1089 10.0106 3.5516 0.7081 6.2054 3.3043 8.3841 1.8461 26.0256 2.3642 5.8175 9.3124 7.7368 8.6598 4.0952 5.2198 1.2162 9.4318 51.3969 11.8365 0.8040 14.4289 8.4866 0.8864 44.1500 2.2618 7.3609 13.0658 82.4433 1.1131 5.4659 3.1418 2.3547 6.4987 13.0627 15.2397 0.4570 2.5847 83.7106 1.9294 0.0713 3.5488 6.5224 0.8524 56.3592 49.8349 10.0863 11.7381 10.7724 26.0833 6.8906 4.3937 4.3476 4.0003 6.0653 19.6848 24.1573 107.7761 8.0320 112.9957 2.9413 2.6080 173.5256 11.1739 0.6486 1.2315 31.9353 3.7420 11.1006 7.4577 11.9983 85.1970 4.8467 49.6626 12.4658 33.3128 8.3045 9.4698 73.6730 5.4607 1.8628 0.2376 2.2569 3.3024 20.1104 49.3043 54.2221 117.4165 47.0339 36.5861 16.2167 19.5884 19.6968 41.7243 7.5675 39.3278 7.5695 35.7746 1.0750 36.0716 28.9960 88.9354 22.3578 28.7549 5.0104 6.7229 14.4122 13.2553 27.7691 23.4576 6.2394
temp: 298.150 k
press: 1.00000 atm
elementType: 16 8 7 7 6 6 6 6 6 6 6 6 6 6 6 6 6 6 6 6 6 1 1 1 1 1 1 1 1 1 1 1 1 1 1 1 1 1 1 1 1 1 1
symmnumber: 1
zpe: 939395.3 jmol-1
zpe.correction: 0.357797 hartree
zpe.thermalcorrener: 0.377963 hartree
zpe.thermalcorrenthalpy: 0.378907 hartree
zpe.thermalcorrgfe: 0.305237 hartree
zpe.sumelectzpe: -1242.222016 hartree
zpe.sumelectthermal: -1242.201849 hartree
zpe.sumelectthermalent: -1242.200905 hartree
zpe.sumelectthermalfe: -1242.274575 hartree
dipole: -1.6097 -0.5150 -1.9782
dipole: 2.6018
quadrupole: -124.6414 -127.9873 -136.9483
quadrupole: -1.2629 -17.2577 -6.3962
quadrupole: 5.2176 1.8717 -7.0893 -1.2629 -17.2577 -6.3962
hfenergy: -1242.5798125 hartree
pointgroup: C01 [X(C17H22N2O1S1)]
dipole: 0.6113939 -0.0620934 -0.8186336 debye
polarizability: 311.7917035|-15.6000068|216.6696343|4.6931996|-19.3504641|143.8380552 unknown
InChI: InChI=1S/C17H22N2OS/c1(4-10-19-11-13-21-14-19)5-12-20-17-9-8-15-6-2-3-7-16(15)18-17/h2-3,6-9H,1,4-5,10-14H2
charge 0 multiplicity 1
43 atoms
S  -7.521533 -0.6466 1.924675
O  1.205566 1.29377 -0.403049
N  -6.213825 0.169349 -0.386691
N  2.853119 -0.336399 0.057118
C  -4.873521 -0.48123 -0.29524
C  -3.723082 0.541598 -0.377993
C  -7.304753 -0.723629 -0.842676
C  -2.335067 -0.125569 -0.25267
C  -6.66647 0.794033 0.831388
C  -7.730491 -1.664388 0.338498
C  -1.179214 0.893239 -0.383968
C  0.186545 0.227182 -0.211681
C  2.53548 0.925859 -0.252833
C  5.244562 0.339814 0.020878
C  4.201854 -0.649195 0.199784
C  3.490792 1.983935 -0.452978
C  4.838246 1.679173 -0.31434
C  6.611631 -0.045048 0.18212
C  4.566499 -1.98987 0.534381
C  6.943873 -1.363812 0.510517
C  5.913365 -2.339094 0.686986
H  -4.784316 -1.077968 0.643149
H  -4.788088 -1.186208 -1.143653
H  -3.834198 1.300504 0.422458
H  -3.801739 1.085082 -1.339275
H  -8.169332 -0.098521 -1.132496
H  -6.98101 -1.300765 -1.725585
H  -2.228571 -0.907727 -1.033222
H  -2.263158 -0.647316 0.72439
H  -7.464903 1.526691 0.645701
H  -5.850288 1.22656 1.42525
H  -8.782776 -1.976363 0.245854
H  -7.081972 -2.553365 0.404079
H  -1.221392 1.38432 -1.375172
H  -1.291514 1.691144 0.375322
H  0.315684 -0.215414 0.79365
H  0.362676 -0.570699 -0.957814
H  3.131846 2.984505 -0.70522
H  5.600578 2.453486 -0.458073
H  7.397194 0.708342 0.045377
H  3.763455 -2.721813 0.665513
H  7.992758 -1.654216 0.633732
H  6.183886 -3.369278 0.944409
