program: Gaussian 09
title: 000218891
version: EM64L-G09RevD.01
frameworkgroup: C1[X(C18H29BrN2OS)]
method: RPBEPBE
basis: SDD
operation: Freq
keyword: #p
keyword: freq=noraman
keyword: PBEPBE/SDD
title: #p freq=noraman PBEPBE/SDD
converged: YES YES NO NO
title: Mulliken charges:
elementType: Br S O N N C C C C C C C C C C C C C C C C C C H H H H H H H H H H H H H H H H H H H H H H H H H H H H H
charge: 0.010014 0.110468 -0.258340 -0.029875 -0.048096 -0.371135 -0.385711 -0.386286 -0.332917 -0.385560 -0.384490 -0.373355 -0.382111 -0.661086 -0.378078 -0.704561 -0.398551 -0.289549 0.170772 -0.317476 -0.081796 -0.309790 -0.157186 0.195773 0.190646 0.192723 0.213486 0.194979 0.197154 0.208244 0.211599 0.195358 0.194697 0.195150 0.194582 0.232945 0.240152 0.196440 0.195977 0.282375 0.251943 0.194722 0.195295 0.261840 0.257682 0.212564 0.212587 0.224487 0.223457 0.261125 0.259877 0.256836
chargesum: 0.00000
title: Mulliken charges with hydrogens summed into heavy atoms:
elementType: Br S O N N C C C C C C C C C C C C C C C C C C
charge: 0.010014 0.110468 -0.258340 -0.029875 -0.048096 0.015284 0.020498 0.005847 0.086926 0.004496 0.005242 0.099742 0.010306 -0.126769 0.011939 -0.185039 0.026600 0.158395 0.170772 -0.056351 0.178080 -0.052954 -0.157186
polarizability: 3.71384180e+02 2.33776688e+01 2.08816788e+02 3.41233972e+00 4.43457325e+00 1.69962865e+02
1716.lowfreq: -35.4979 -4.0842 -2.7639 -0.0015 0.0013 0.0015 1.4571 6.9107 14.2693
frequency: -24.8227 4.3469 11.8090 15.2450 23.4318 36.5287 43.0795 61.5666 64.8584 81.4449 89.1789 102.6356 104.3579 115.9478 134.5895 136.6739 138.5704 156.1410 161.9609 175.0148 214.4036 236.2023 276.1016 300.5094 305.3678 343.7161 377.0228 407.7316 420.0884 425.0027 460.4670 471.6389 489.1321 507.8120 511.2815 524.2217 615.8949 633.8657 647.6504 664.9250 718.7784 723.4237 735.7786 736.5708 758.6764 791.2714 806.5364 813.5050 827.4883 840.4045 874.2118 899.9403 905.1754 909.4143 911.0183 942.3108 960.9464 963.2951 963.7964 985.1467 990.7246 999.0245 1018.9909 1025.6734 1038.6734 1051.1800 1071.1207 1073.7608 1077.9305 1081.8134 1085.0233 1098.4757 1107.9662 1122.9719 1125.9988 1148.9006 1152.0411 1190.9285 1201.5629 1207.4136 1223.1498 1235.3053 1243.1971 1250.2975 1254.9216 1261.2688 1269.2594 1275.1380 1282.2376 1282.9937 1286.2827 1293.6748 1295.9626 1299.7449 1306.9099 1308.5758 1322.6185 1328.4811 1334.2868 1341.7401 1351.6176 1354.8713 1357.9951 1374.7527 1376.0784 1438.5750 1450.5864 1455.2417 1458.4535 1458.9358 1462.5720 1463.4938 1465.2019 1468.1548 1473.0583 1476.7513 1481.2333 1485.8597 1488.5357 1539.7828 1571.3701 2906.5092 2949.4123 2950.0374 2952.0042 2954.0334 2959.1044 2964.5222 2975.0837 2983.0800 2987.7650 2988.4610 2995.7975 2999.0671 3007.3215 3007.6231 3018.5774 3025.2785 3032.2233 3036.7467 3044.7826 3051.0221 3059.6188 3073.3832 3078.5693 3108.6904 3149.2679 3153.3401 3164.7375 3185.7046
redmass: 1.8637 4.2535 5.3739 4.5349 4.9050 6.0814 4.7362 1.8569 4.6795 3.9069 4.9583 2.6993 2.3194 3.2518 2.3984 2.5140 2.6037 2.4483 3.2800 3.8049 5.5676 4.5727 3.7889 6.7376 5.7246 3.0806 3.1964 3.1142 3.7686 3.4912 3.8713 3.3959 3.1804 2.9139 4.3666 4.1284 7.9803 4.8700 8.4142 3.0172 1.0603 1.0743 1.0981 4.8638 1.1287 1.1803 2.6214 7.1832 1.5002 1.2341 1.7596 1.3035 1.5382 3.1595 1.3973 8.4183 5.5866 1.2486 1.3006 3.4380 4.9433 1.9347 1.1764 2.1859 3.7901 2.7921 2.5251 2.6131 2.6441 2.1021 2.2716 2.1784 2.4622 1.3644 1.4198 1.3953 1.3633 1.5490 1.2926 1.2570 1.3928 1.3143 1.4389 1.2608 2.5668 1.3159 1.3134 1.1550 1.0729 1.6793 1.1216 1.1156 1.1275 1.2901 1.1982 1.4246 5.4909 1.4951 1.4130 1.9949 1.6008 1.7077 1.6260 1.4112 1.6653 2.1968 1.0897 1.0811 1.0741 1.0723 1.0732 1.0797 1.0774 1.0960 1.1019 1.1012 1.0989 1.0993 1.1008 7.3636 6.4303 1.0681 1.0586 1.0586 1.0592 1.0591 1.0593 1.0586 1.0613 1.0960 1.0610 1.0960 1.0998 1.0565 1.0934 1.0688 1.0956 1.1014 1.0584 1.1040 1.1045 1.1031 1.0576 1.1078 1.1030 1.1093 1.1117 1.0931 1.0896 1.0982
irintensity: 0.0547 0.0898 0.4778 0.0573 0.3933 0.0641 0.4733 0.2442 0.5213 0.5432 0.2372 0.5873 0.1333 0.7980 0.8309 0.2215 0.8179 1.3007 5.8176 3.0073 1.9813 0.5315 1.2021 3.7139 0.2238 5.0772 8.1778 1.1300 1.9067 24.9748 10.0531 0.0475 2.4631 10.7499 6.5136 9.2783 1.7365 48.7968 57.8474 11.8799 16.2252 0.0361 4.5158 1.8102 0.0812 0.6822 12.1820 0.6608 51.6306 0.2238 5.4181 0.6370 6.0585 10.1580 7.2055 83.7275 33.5530 0.5259 0.2529 1.6554 0.8901 16.8982 1.9256 37.7318 2.4748 3.0248 45.2980 0.8221 23.7701 0.2748 20.3437 19.1973 3.9739 15.3730 13.0504 4.9191 1.6294 6.4167 11.8119 35.6809 10.6484 3.6868 4.9757 6.5982 313.1868 10.3872 19.2231 4.3656 1.0348 15.1454 0.1655 1.9031 0.1478 4.7561 1.9425 21.8041 13.0787 21.4156 4.2988 110.7510 11.5089 0.3973 0.4164 3.7069 9.6527 281.5583 7.9175 10.2497 0.4486 0.9180 0.1423 4.5316 1.0710 0.4547 2.6433 0.6898 1.1507 6.9817 28.2167 9.1272 94.2028 35.5227 0.6444 0.9026 0.8446 2.2639 4.2454 148.4766 58.9846 0.3166 19.2829 3.1712 0.3614 41.7467 4.9397 38.3658 6.9100 4.5831 34.3249 50.4448 40.1228 150.1270 29.5883 83.0241 20.8305 28.5744 12.6490 10.5846 1.7784 2.9205
temp: 298.150 k
press: 1.00000 atm
elementType: 35 16 8 7 7 6 6 6 6 6 6 6 6 6 6 6 6 6 6 6 6 6 6 1 1 1 1 1 1 1 1 1 1 1 1 1 1 1 1 1 1 1 1 1 1 1 1 1 1 1 1 1
symmnumber: 1
zpe: 1156425.3 jmol-1
zpe.correction: 0.440459 hartree
zpe.thermalcorrener: 0.465904 hartree
zpe.thermalcorrenthalpy: 0.466848 hartree
zpe.thermalcorrgfe: 0.376684 hartree
zpe.sumelectzpe: -1297.735554 hartree
zpe.sumelectthermal: -1297.710109 hartree
zpe.sumelectthermalent: -1297.709165 hartree
zpe.sumelectthermalfe: -1297.799329 hartree
dipole: 0.6593 1.5118 -1.9632
dipole: 2.5641
quadrupole: -191.7810 -153.4556 -163.1017
quadrupole: -1.3224 -25.3555 -1.4783
quadrupole: -22.3349 15.9905 6.3444 -1.3224 -25.3555 -1.4783
hfenergy: -1298.176013 hartree
pointgroup: C01 [X(C18H29Br1N2O1S1)]
dipole: -0.2533123 0.6649502 0.7150773 debye
polarizability: 369.933543|-26.9524579|209.0324193|8.1230219|-8.208499|171.1978709 unknown
InChI: InChI=1S/C18H29BrN2OS/c19-17-9-10-18(20-15-17)22-13-8-6-4-2-1-3-5-7-11-21-12-14-23-16-21/h9-10,15H,1-8,11-14,16H2
charge 0 multiplicity 1
52 atoms
Br 11.047675 -1.141571 0.01611
S  -9.953172 -0.238924 -1.899863
O  5.357303 1.014893 -0.320851
N  -8.540423 -0.451269 0.48431
N  6.844222 -0.780387 0.105501
C  -4.778356 0.507663 0.165802
C  -6.018104 -0.376407 0.42938
C  -3.444032 -0.24976 0.348357
C  -7.336474 0.404172 0.261966
C  -2.202746 0.621896 0.053443
C  -0.867449 -0.132384 0.241791
C  -9.772927 0.301982 0.817507
C  0.373108 0.734973 -0.067952
C  -8.871629 -1.325688 -0.613108
C  1.706567 -0.022868 0.118698
C  -10.341366 0.963617 -0.485767
C  2.942909 0.852604 -0.192288
C  4.244346 0.071024 -0.014631
C  6.64571 0.518225 -0.240128
C  7.705672 1.421103 -0.531743
C  9.023419 0.939109 -0.45853
C  8.126698 -1.243053 0.174921
C  9.231634 -0.415743 -0.099479
H  -4.828853 0.915783 -0.865412
H  -4.796404 1.383869 0.847856
H  -5.999719 -1.240989 -0.264904
H  -5.980599 -0.795511 1.453624
H  -3.433445 -1.138137 -0.317515
H  -3.382279 -0.639033 1.385964
H  -7.368072 1.218252 1.010618
H  -7.367667 0.878314 -0.747419
H  -2.263581 1.004622 -0.986902
H  -2.215697 1.514545 0.713644
H  -0.802277 -0.507245 1.284723
H  -0.859091 -1.030027 -0.411637
H  -10.520425 -0.40923 1.214714
H  -9.55996 1.054304 1.596093
H  0.307696 1.109625 -1.110662
H  0.366696 1.632132 0.585729
H  -9.535212 -2.144589 -0.300441
H  -7.990206 -1.700706 -1.149806
H  1.710991 -0.919062 -0.53644
H  1.769921 -0.398848 1.161129
H  -11.431731 1.106478 -0.423123
H  -9.850362 1.927116 -0.699684
H  2.885252 1.232125 -1.23073
H  2.956312 1.73713 0.473584
H  4.312326 -0.793324 -0.701275
H  4.371252 -0.303657 1.018304
H  7.483344 2.455785 -0.803223
H  9.869581 1.597495 -0.674372
H  8.256921 -2.292921 0.455415
