program: Gaussian 09
title: 000218889
version: EM64L-G09RevD.01
frameworkgroup: C1[X(C16H25BrN2OS)]
method: RPBEPBE
basis: SDD
operation: Freq
keyword: #p
keyword: freq=noraman
keyword: PBEPBE/SDD
title: #p freq=noraman PBEPBE/SDD
converged: YES YES NO NO
title: Mulliken charges:
elementType: Br S O N N C C C C C C C C C C C C C C C C H H H H H H H H H H H H H H H H H H H H H H H H H
charge: 0.010403 0.110906 -0.258441 -0.030158 -0.048115 -0.386367 -0.332139 -0.370190 -0.384811 -0.373271 -0.381100 -0.661282 -0.378558 -0.704623 -0.398110 -0.289498 0.170728 -0.317410 -0.081683 -0.309645 -0.157249 0.213872 0.193035 0.208477 0.211493 0.191173 0.196128 0.195230 0.197505 0.196311 0.196961 0.240253 0.233156 0.251826 0.282595 0.195298 0.195840 0.262125 0.257781 0.212944 0.212534 0.223730 0.224298 0.261172 0.259967 0.256909
chargesum: 0.00000
title: Mulliken charges with hydrogens summed into heavy atoms:
elementType: Br S O N N C C C C C C C C C C C C C C C C
charge: 0.010403 0.110906 -0.258441 -0.030158 -0.048115 0.020540 0.087831 0.017111 0.007924 0.100139 0.012172 -0.126861 0.012579 -0.184717 0.027368 0.158529 0.170728 -0.056239 0.178284 -0.052735 -0.157249
polarizability: 3.39672287e+02 2.20769774e+01 1.89704458e+02 2.38831537e+00 4.33812032e+00 1.53037639e+02
1716.lowfreq: -31.1664 -2.5620 -1.8238 -0.0013 -0.0010 0.0018 7.6289 12.5971 19.3005
frequency: -15.5278 12.2564 13.2422 21.1162 29.4868 44.3903 55.6480 78.4046 83.1430 99.4293 106.5053 118.1656 126.5656 133.0051 151.6598 161.5099 165.9463 207.0750 236.9032 270.8712 300.5421 320.6496 340.1463 388.1941 414.8346 420.0941 451.6334 462.0167 479.3168 507.8724 509.9964 523.6060 616.0173 633.8857 647.7498 664.5678 720.6697 731.0360 736.5883 755.1797 792.9197 806.3335 813.8320 827.5483 853.7562 874.6075 905.0888 909.3973 911.1758 930.3337 943.1488 961.0406 963.7096 987.9596 1002.6907 1004.4845 1006.7474 1032.3112 1060.4606 1063.7059 1071.2861 1082.1123 1084.2863 1097.5183 1105.9465 1122.7038 1125.9620 1147.9613 1153.2960 1194.9611 1208.9487 1213.1046 1231.7091 1248.7602 1250.2785 1254.2262 1259.0203 1273.3065 1281.1804 1282.8188 1289.4040 1292.6101 1295.7781 1307.2350 1307.7024 1322.6454 1328.2615 1334.3305 1342.8029 1354.8263 1356.8145 1375.6413 1376.3143 1438.8188 1450.6341 1455.4804 1459.7578 1461.3045 1463.8787 1465.8727 1469.4856 1474.6923 1478.7278 1484.9073 1488.4509 1539.9734 1571.5545 2906.3928 2951.0360 2952.6925 2956.1739 2963.8805 2975.9271 2986.4887 2987.8999 2995.1255 2999.0182 3007.6133 3010.2142 3020.5968 3032.1252 3032.7354 3044.2180 3051.6763 3059.7562 3073.3926 3078.5460 3109.2293 3149.3917 3153.4189 3164.7192 3185.7370
redmass: 2.2920 6.1135 4.1610 3.7514 4.1820 5.9801 4.6862 3.8162 1.9964 3.5429 5.3344 3.6072 1.9197 2.6018 2.5992 3.3062 3.3667 4.3922 5.4775 4.5918 6.7357 3.7987 3.7649 3.0562 2.8248 3.7711 4.5854 3.6007 3.0539 2.9141 4.2998 4.3190 7.9827 4.8908 8.4269 3.0046 1.0632 1.0839 4.9086 1.1166 1.1784 2.6965 6.6461 1.4999 1.2409 1.7746 1.5724 3.2703 1.3959 1.2527 8.3653 5.5710 1.3289 2.7353 1.8262 2.0950 1.8766 2.2425 3.2783 2.7886 2.5149 2.1220 2.2956 2.2822 2.3135 1.3451 1.4174 1.4295 1.3100 1.4459 1.3038 1.2185 1.4771 1.3389 1.2776 1.9173 1.6732 1.1617 1.0973 1.6866 1.1693 1.1905 1.1559 1.1806 1.4465 4.9884 1.5460 1.4161 2.0631 1.5962 1.6847 1.4452 1.6210 2.1969 1.0905 1.0813 1.0722 1.0761 1.0827 1.0753 1.0983 1.1029 1.0991 1.0987 1.1006 7.3713 6.4358 1.0680 1.0588 1.0588 1.0593 1.0590 1.0611 1.0961 1.0598 1.0989 1.0565 1.0609 1.1007 1.0940 1.0938 1.0672 1.1044 1.1033 1.0576 1.1078 1.1030 1.1094 1.1117 1.0931 1.0897 1.0982
irintensity: 0.0715 0.0389 0.5348 0.1085 0.5310 0.1594 0.6710 0.4925 0.4465 0.4904 0.3205 0.7662 0.7263 0.9199 1.4589 5.8725 1.1654 2.3765 4.1343 0.8011 3.7871 0.9814 0.0449 16.5287 12.2043 1.9738 9.4611 9.5511 2.2335 10.7548 1.3722 13.0697 1.6714 53.0246 54.3333 11.8395 13.6837 0.0402 1.5877 2.9183 0.0099 11.8368 0.7144 51.6840 0.1548 5.4617 7.2481 9.6233 7.0960 0.4699 82.4160 34.3480 0.0625 25.3927 1.2154 3.5917 0.8109 10.9299 37.6833 18.9172 35.8281 0.0604 19.0634 19.0367 6.3899 16.2924 11.3014 4.4644 2.1703 11.2149 6.4330 34.6698 8.7503 18.8178 18.4225 203.6846 111.1024 2.4513 1.0718 17.2792 0.6334 0.2846 0.7108 7.5020 17.9643 8.4830 29.0883 18.4764 103.5299 5.6598 0.2120 7.1688 5.7078 281.8626 8.1226 10.4817 0.4073 0.3657 5.6270 0.1192 1.8744 1.2237 1.6114 3.5151 24.9209 9.2398 93.6395 35.7658 2.6166 0.7965 1.1908 84.9219 54.3100 0.9948 19.9357 2.6609 42.3827 38.2363 1.5010 13.3553 18.5952 39.5031 11.0349 125.6541 29.4935 83.3065 21.2076 28.2761 12.6865 10.4626 1.7750 2.8919
temp: 298.150 k
press: 1.00000 atm
elementType: 35 16 8 7 7 6 6 6 6 6 6 6 6 6 6 6 6 6 6 6 6 1 1 1 1 1 1 1 1 1 1 1 1 1 1 1 1 1 1 1 1 1 1 1 1 1
symmnumber: 1
zpe: 1010344.8 jmol-1
zpe.correction: 0.384820 hartree
zpe.thermalcorrener: 0.407405 hartree
zpe.thermalcorrenthalpy: 0.408349 hartree
zpe.thermalcorrgfe: 0.326615 hartree
zpe.sumelectzpe: -1219.289346 hartree
zpe.sumelectthermal: -1219.266762 hartree
zpe.sumelectthermalent: -1219.265818 hartree
zpe.sumelectthermalfe: -1219.347552 hartree
dipole: 0.6600 1.4633 -1.9648
dipole: 2.5372
quadrupole: -171.2416 -140.1098 -149.9493
quadrupole: -1.2123 -22.6439 -1.4074
quadrupole: -17.4747 13.6571 3.8176 -1.2123 -22.6439 -1.4074
hfenergy: -1219.6741663 hartree
pointgroup: C01 [X(C16H25Br1N2O1S1)]
dipole: 0.252184 0.655756 -0.7090838 debye
polarizability: 338.1981274|25.7341273|189.8102693|7.0255727|8.3386754|154.4059876 unknown
InChI: InChI=1S/C16H25BrN2OS/c17-15-7-8-16(18-13-15)20-11-6-4-2-1-3-5-9-19-10-12-21-14-19/h7-8,13H,1-6,9-12,14H2
charge 0 multiplicity 1
46 atoms
Br -9.808192 -1.036512 0.013241
S  8.649039 -0.233846 1.835558
O  -4.079337 1.019794 0.320245
N  7.214766 -0.439767 -0.536109
N  -5.600741 -0.742524 -0.121876
C  4.693252 -0.347339 -0.451646
C  6.01913 0.424209 -0.302375
C  3.464448 0.546184 -0.169454
C  2.121702 -0.200942 -0.331341
C  8.448774 0.306305 -0.880625
C  0.893697 0.681778 -0.015283
C  7.551178 -1.315434 0.558915
C  -0.449937 -0.062758 -0.181234
C  9.032524 0.965442 0.41698
C  -1.670999 0.826556 0.150106
C  -2.985539 0.064691 -0.017223
C  -5.376678 0.545301 0.247238
C  -6.417679 1.4593 0.570561
C  -7.744008 1.000405 0.504469
C  -6.891543 -1.182662 -0.184533
C  -7.979159 -0.343177 0.120585
H  4.637915 -0.765561 -1.475415
H  4.678509 -1.212021 0.242524
H  6.047582 1.235854 -1.053784
H  6.064932 0.900932 0.705232
H  3.47897 1.422232 -0.851711
H  3.533961 0.953713 0.860825
H  2.114805 -1.089625 0.334067
H  2.040081 -0.588561 -1.368111
H  0.902128 1.573873 -0.675822
H  0.9747 1.063535 1.023706
H  8.233481 1.059276 -1.657946
H  9.188565 -0.409576 -1.283823
H  6.672743 -1.685946 1.103552
H  8.207643 -2.137835 0.24046
H  -0.453814 -0.958822 0.473998
H  -0.533827 -0.437712 -1.222513
H  10.123155 1.101295 0.345014
H  8.549367 1.932034 0.634599
H  -1.596017 1.197752 1.190435
H  -1.680343 1.716094 -0.509142
H  -3.13422 -0.293979 -1.052897
H  -3.054343 -0.807908 0.658881
H  -6.174855 2.484431 0.860037
H  -8.576426 1.667856 0.744541
H  -7.042589 -2.224332 -0.484507
