program: Gaussian 09
title: 000218862
version: EM64L-G09RevD.01
frameworkgroup: C1[X(C13H19BrN2OS)]
method: RPBEPBE
basis: SDD
operation: Freq
keyword: #p
keyword: freq=noraman
keyword: PBEPBE/SDD
title: #p freq=noraman PBEPBE/SDD
converged: NO YES NO NO
title: Mulliken charges:
elementType: Br S O N N C C C C C C C C C C C C C H H H H H H H H H H H H H H H H H H H
charge: 0.007249 0.113225 -0.252240 -0.032101 0.027557 -0.329842 -0.381446 -0.370869 -0.364165 -0.659554 -0.705224 -0.396815 -0.291271 0.147133 -0.321960 -0.138210 -0.307499 -0.141742 0.211787 0.208754 0.216215 0.194208 0.233842 0.240165 0.193863 0.197196 0.282676 0.251367 0.258554 0.262937 0.215320 0.214250 0.227651 0.227014 0.259528 0.246636 0.255810
chargesum: 0.00000
title: Mulliken charges with hydrogens summed into heavy atoms:
elementType: Br S O N N C C C C C C C C C C C C C
charge: 0.007249 0.113225 -0.252240 -0.032101 0.027557 0.090699 0.028978 0.103138 0.026894 -0.125511 -0.183734 0.032755 0.163394 0.147133 -0.062432 0.108426 -0.307499 0.114069
polarizability: 2.46182427e+02 -1.36742045e+00 2.04446280e+02 2.85959742e-01 5.58863950e+00 1.25994958e+02
1716.lowfreq: -3.2533 0.0014 0.0016 0.0020 4.2721 8.2341 17.7398 20.2612 28.5132
frequency: 17.1391 20.1949 28.0610 47.5812 65.9711 75.2206 91.5778 118.9184 127.5261 138.1465 154.7659 161.9070 179.2856 205.7558 224.5906 275.5702 281.5339 350.0041 367.6205 419.0606 449.0360 450.1721 466.1950 502.0132 523.7841 606.0688 606.3820 631.9977 658.5224 667.9374 725.7627 735.5749 769.0800 789.4059 806.8872 839.1260 841.2213 875.0827 885.4664 906.0243 910.6164 937.3151 946.9092 956.7839 979.6987 993.5941 1018.1090 1038.5413 1052.3865 1061.3743 1079.7692 1095.5380 1104.1807 1121.8367 1126.2233 1145.8840 1159.6115 1164.3262 1201.3375 1223.4024 1236.6674 1252.4343 1254.0078 1266.6619 1279.4694 1289.0287 1301.7466 1303.8742 1312.1763 1334.6821 1335.4119 1351.3248 1369.5432 1376.0256 1386.3573 1426.4053 1452.3288 1456.6487 1465.2683 1468.6011 1469.3883 1475.5345 1480.1418 1490.4546 1537.4501 1580.1986 2907.1193 2959.8763 2979.9119 2991.3819 3000.2218 3003.9611 3008.6819 3022.9803 3032.7951 3042.1149 3054.4803 3060.4219 3075.6605 3078.7792 3108.7890 3150.5310 3155.0824 3188.3609 3198.8777
redmass: 7.0729 5.2120 5.6675 5.5440 2.1352 4.2350 3.4251 1.9527 3.4470 2.9608 3.1115 3.1493 5.7513 3.6818 6.0107 4.2016 10.7967 3.2322 2.8966 3.7675 3.5603 3.9032 3.1494 4.5976 4.9043 5.9622 6.7379 4.9151 8.0089 3.0598 2.7231 1.0728 1.1212 1.5840 2.6305 1.2766 5.7508 1.7778 1.3750 1.5703 3.3675 6.5549 8.2383 1.2467 1.3258 1.9363 2.0838 3.7838 2.6089 1.7147 2.1993 2.5038 2.0774 1.6568 1.8450 1.4774 1.2142 1.1780 1.3021 1.3158 1.2668 1.3446 1.3242 2.7605 1.1479 1.0871 1.3806 1.1812 1.4070 7.2743 1.3909 1.4220 1.6219 1.4181 2.9926 2.7284 1.0903 1.0808 1.0844 1.0732 1.0928 1.1052 1.0970 1.1000 6.1651 6.6697 1.0681 1.0590 1.0607 1.0600 1.0569 1.0981 1.0606 1.0917 1.0583 1.1030 1.1042 1.0581 1.1076 1.1031 1.1094 1.1111 1.0896 1.0946 1.0981
irintensity: 0.6431 0.2482 0.6273 1.3849 0.0954 0.6103 3.7478 0.3152 0.6645 2.1874 2.0336 5.7844 0.2128 2.2619 0.3260 5.7335 9.1601 5.6864 5.7069 22.6164 9.9013 0.0005 4.8704 0.8695 15.9852 1.1994 4.0663 49.7797 12.1917 12.2463 12.8884 8.6666 0.3751 76.2395 20.2897 3.9207 92.6364 7.5748 0.7796 9.1742 10.1408 9.4881 132.3154 2.0042 1.0291 4.9969 2.0447 42.5536 59.2988 5.8820 8.6386 9.5134 26.9264 36.2743 17.0874 3.4315 4.2600 27.8789 19.2780 22.9942 0.9617 5.3644 0.6092 280.3475 5.7902 1.6556 16.3750 1.9458 17.0779 60.4336 10.4825 16.7545 67.9650 3.5980 91.0489 216.7452 8.8652 10.3566 2.9249 2.8034 1.3127 2.4941 3.4114 16.0738 106.9056 278.8024 37.0664 14.9991 21.4974 14.7784 42.5537 8.9448 38.7415 8.8849 35.3154 2.0363 40.9636 29.3737 77.5688 23.0277 28.3333 12.3979 8.2976 2.5946 2.3516
temp: 298.150 k
press: 1.00000 atm
elementType: 35 16 8 7 7 6 6 6 6 6 6 6 6 6 6 6 6 6 1 1 1 1 1 1 1 1 1 1 1 1 1 1 1 1 1 1 1
symmnumber: 1
zpe: 791781.1 jmol-1
zpe.correction: 0.301574 hartree
zpe.thermalcorrener: 0.320632 hartree
zpe.thermalcorrenthalpy: 0.321576 hartree
zpe.thermalcorrgfe: 0.249291 hartree
zpe.sumelectzpe: -1101.623638 hartree
zpe.sumelectthermal: -1101.604580 hartree
zpe.sumelectthermalent: -1101.603636 hartree
zpe.sumelectthermalfe: -1101.675921 hartree
dipole: 0.5843 1.9960 -1.9043
dipole: 2.8199
quadrupole: -127.6464 -120.6563 -129.8302
quadrupole: 14.9654 17.2392 5.4482
quadrupole: -1.6021 5.3880 -3.7859 14.9654 17.2392 5.4482
hfenergy: -1101.9252119 hartree
pointgroup: C01 [X(C13H19Br1N2O1S1)]
dipole: 0.2989702 0.5060191 -0.9409815 debye
polarizability: 245.389278|-5.8837602|201.7563503|0.2886628|-17.1708851|129.4780368 unknown
InChI: InChI=1S/C13H19BrN2OS/c14-12-5-4-6-13(15-12)17-9-3-1-2-7-16-8-10-18-11-16/h4-6H,1-3,7-11H2
charge 0 multiplicity 1
37 atoms
Br 5.460431 -2.996668 0.969531
S  -6.528207 0.095418 1.804041
O  2.341944 0.98745 -0.2430
N  -5.116917 0.177662 -0.587088
N  3.884107 -0.726841 0.29551
C  -3.818326 -0.479545 -0.256039
C  -2.612263 0.455858 -0.472466
C  -6.235755 -0.766985 -0.82041
C  -1.269393 -0.253948 -0.187287
C  -5.579831 1.136871 0.385469
C  -6.747667 -1.316594 0.556497
C  -0.058442 0.694662 -0.346915
C  1.261528 -0.026906 -0.07537
C  3.641004 0.568975 -0.038421
C  4.676789 1.529014 -0.189606
C  5.999755 1.099847 0.020655
C  5.155991 -1.101425 0.487947
C  6.270402 -0.249835 0.370612
H  -3.816148 -0.856324 0.794155
H  -3.715676 -1.35554 -0.923918
H  -2.634572 0.829302 -1.514332
H  -2.696822 1.343764 0.185556
H  -7.057622 -0.217458 -1.315174
H  -5.911296 -1.582841 -1.488718
H  -1.157526 -1.119601 -0.8727
H  -1.282038 -0.668669 0.84219
H  -6.340643 1.810356 -0.034584
H  -4.766915 1.696056 0.866733
H  -6.154885 -2.181153 0.897439
H  -7.812945 -1.592249 0.508394
H  -0.039714 1.115193 -1.370686
H  -0.155428 1.548326 0.351041
H  1.314432 -0.435066 0.951188
H  1.441003 -0.857016 -0.783697
H  4.428054 2.557523 -0.459521
H  6.828338 1.807339 -0.085065
H  7.284955 -0.613149 0.540635
