program: Gaussian 09
title: 000218857
version: EM64L-G09RevD.01
frameworkgroup: C1[X(C13H19BrN2OS)]
method: RPBEPBE
basis: SDD
operation: Freq
keyword: #p
keyword: freq=noraman
keyword: PBEPBE/SDD
title: #p freq=noraman PBEPBE/SDD
converged: YES YES NO NO
title: Mulliken charges:
elementType: Br S O N N C C C C C C C C C C C C C H H H H H H H H H H H H H H H H H H H
charge: 0.021351 0.110354 -0.257351 -0.030187 -0.052607 -0.334011 -0.371644 -0.372500 -0.354476 -0.660784 -0.703811 -0.409516 -0.283894 0.278647 -0.337119 -0.100661 -0.319432 -0.205165 0.210956 0.211830 0.214661 0.185466 0.232567 0.241435 0.228472 0.188153 0.282030 0.250927 0.258448 0.261609 0.219501 0.196268 0.234499 0.223418 0.259243 0.245513 0.237811
chargesum: 0.00000
title: Mulliken charges with hydrogens summed into heavy atoms:
elementType: Br S O N N C C C C C C C C C C C C C
charge: 0.021351 0.110354 -0.257351 -0.030187 -0.052607 0.088775 0.028484 0.101501 0.062149 -0.127827 -0.183754 0.006253 0.174024 0.278647 -0.337119 0.158582 -0.073920 0.032646
polarizability: 2.30521889e+02 1.10695834e+01 2.00079460e+02 -1.73081272e+01 -5.33472857e+00 1.35263196e+02
1716.lowfreq: -25.1276 -6.9607 -4.0238 -0.0012 -0.0012 -0.0005 6.1305 13.3132 17.5796
frequency: -21.8695 12.9142 16.9619 38.5811 67.1180 80.3548 94.2701 114.0425 117.4353 135.4852 141.0136 160.0386 203.6958 236.4929 265.4480 279.0592 305.0994 327.1849 395.6643 423.7704 448.8750 459.8337 469.5263 485.7470 522.0719 548.1130 599.9890 630.4893 663.4230 666.1036 733.6731 744.0574 763.8863 792.7672 801.0958 820.1136 865.0978 885.4024 898.4588 905.6160 908.4869 924.0482 943.0918 963.6399 979.5507 992.4037 1012.0598 1035.0161 1058.2950 1061.6589 1074.1004 1094.3239 1101.5655 1119.4237 1121.4432 1142.3477 1157.2664 1197.7478 1212.2797 1225.5123 1236.4723 1248.4416 1250.3310 1270.8906 1277.9524 1289.1053 1303.4461 1305.7188 1325.7927 1330.0458 1333.0438 1347.2163 1367.3694 1373.0525 1408.7256 1427.1926 1450.1662 1451.8236 1453.8864 1463.8475 1471.5856 1472.7285 1474.6744 1486.9910 1532.9310 1568.7482 2908.4982 2966.0276 2973.0744 2979.3780 3002.8148 3007.3053 3017.8242 3025.4740 3031.5774 3040.7611 3058.0275 3058.7730 3072.7158 3079.7644 3108.0336 3141.8754 3147.9317 3161.4185 3181.9288
redmass: 4.7425 7.6999 6.0839 5.6912 4.5648 2.3215 3.2681 3.4646 3.7134 5.3835 2.5328 3.0035 3.8793 2.4529 5.2852 5.9415 3.0780 3.3283 3.0134 3.0362 4.6960 3.6460 4.8023 3.2977 4.5975 3.4015 6.6001 4.9175 4.2305 3.5498 1.1978 7.2444 1.5998 1.2489 2.6855 2.0561 1.7330 1.6826 2.3618 1.8930 3.3062 1.3521 1.9466 1.3793 7.6196 1.9249 2.0438 2.1875 2.2165 2.8683 2.1693 2.1756 1.9421 1.5666 1.4025 1.6023 1.2663 1.2439 1.1833 1.5800 1.5501 1.2541 1.2662 2.7578 1.2971 1.0903 1.2258 1.3686 1.3657 6.9927 1.4334 1.4311 1.6650 1.4066 1.9140 2.5775 1.0909 1.0848 1.0811 1.0827 1.0846 1.1165 1.1011 1.0977 6.8836 6.4510 1.0682 1.0622 1.0620 1.0619 1.0598 1.0610 1.0899 1.0936 1.0582 1.1001 1.0902 1.0701 1.1073 1.1026 1.1094 1.0887 1.1115 1.0916 1.1002
irintensity: 0.9544 0.3609 0.1386 0.5820 1.0709 1.5306 0.4064 3.6558 1.7420 4.1241 1.0938 1.2835 2.1880 2.6237 0.2062 3.1917 1.3210 5.7061 6.5442 28.5585 0.2764 7.6809 4.7242 1.9329 15.7917 0.5614 4.0230 49.5387 17.6495 7.9718 9.9775 18.1267 0.0460 59.6954 11.6450 1.9888 1.4916 5.7619 19.2808 29.4704 10.9511 0.1659 43.2645 0.9126 83.1178 7.1331 12.3981 62.9385 18.0278 0.4525 17.5751 32.7756 8.5854 9.5717 9.6508 2.1580 8.5503 8.0349 37.5938 23.6993 1.8294 1.8546 6.8938 202.3167 10.5036 9.9690 15.1347 11.9923 1.1382 21.8198 7.6990 85.5667 0.1703 1.2364 17.0330 238.0519 10.2990 7.0225 6.1667 4.3131 0.8462 1.7423 2.7787 15.6596 0.4350 105.3918 36.6817 9.7501 16.5336 50.5366 22.6559 37.6268 12.3620 7.2919 34.2367 1.4486 51.5826 59.6960 45.2714 19.8657 28.9660 11.3731 12.6841 8.2074 15.3851
temp: 298.150 k
press: 1.00000 atm
elementType: 35 16 8 7 7 6 6 6 6 6 6 6 6 6 6 6 6 6 1 1 1 1 1 1 1 1 1 1 1 1 1 1 1 1 1 1 1
symmnumber: 1
zpe: 791500.9 jmol-1
zpe.correction: 0.301467 hartree
zpe.thermalcorrener: 0.319570 hartree
zpe.thermalcorrenthalpy: 0.320514 hartree
zpe.thermalcorrgfe: 0.250982 hartree
zpe.sumelectzpe: -1101.618614 hartree
zpe.sumelectthermal: -1101.600511 hartree
zpe.sumelectthermalent: -1101.599567 hartree
zpe.sumelectthermalfe: -1101.669099 hartree
dipole: -2.8635 0.1593 -0.1266
dipole: 2.8708
quadrupole: -125.2660 -118.5718 -127.9757
quadrupole: 10.8865 -13.7987 4.5115
quadrupole: -1.3282 5.3661 -4.0379 10.8865 -13.7987 4.5115
hfenergy: -1101.9200806 hartree
pointgroup: C01 [X(C13H19Br1N2O1S1)]
dipole: 1.1144142 -0.1539131 -0.1001979 debye
polarizability: 233.2386639|6.6940772|196.917163|15.5347353|10.0900777|135.7087176 unknown
InChI: InChI=1S/C13H19BrN2OS/c14-12-5-4-6-15-13(12)17-9-3-1-2-7-16-8-10-18-11-16/h4-6H,1-3,7-11H2
charge 0 multiplicity 1
37 atoms
Br 2.847542 -2.6820 -0.580299
S  -6.280403 0.61301 1.474668
O  2.064723 0.325244 -0.410463
N  -4.586733 -0.323472 -0.518411
N  4.043301 1.218009 0.530432
C  -3.225712 -0.213865 0.085174
C  -2.281107 0.673139 -0.749817
C  -5.363279 -1.504589 -0.071902
C  -0.868142 0.755758 -0.131024
C  -5.431719 0.828233 -0.322877
C  -5.914709 -1.245678 1.373725
C  0.097506 1.618469 -0.973271
C  1.50756 1.710287 -0.389398
C  3.34104 0.150264 0.073673
C  3.889498 -1.166317 0.077584
C  5.191421 -1.359527 0.565141
C  5.308575 1.023533 1.003721
C  5.925396 -0.241505 1.041169
H  -3.283526 0.174351 1.129335
H  -2.80266 -1.234789 0.134303
H  -2.225355 0.259989 -1.775567
H  -2.703042 1.694844 -0.841756
H  -6.216149 -1.642356 -0.761753
H  -4.734275 -2.410182 -0.110781
H  -0.442121 -0.261122 -0.032551
H  -0.934317 1.173956 0.895417
H  -6.26879 0.849169 -1.035499
H  -4.877949 1.776462 -0.321987
H  -5.169578 -1.498789 2.145636
H  -6.845112 -1.806177 1.556694
H  0.159692 1.21381 -2.002092
H  -0.296926 2.652145 -1.057457
H  2.170499 2.363477 -0.985052
H  1.510069 2.07368 0.655201
H  5.628189 -2.362411 0.576186
H  5.827645 1.920066 1.359047
H  6.941346 -0.360516 1.42705
