program: Gaussian 09
title: 000218855
version: EM64L-G09RevD.01
frameworkgroup: C1[X(C13H18Cl2N2OS)]
method: RPBEPBE
basis: SDD
operation: Freq
keyword: #p
keyword: freq=noraman
keyword: PBEPBE/SDD
title: #p freq=noraman PBEPBE/SDD
converged: YES YES NO NO
title: Mulliken charges:
elementType: Cl Cl S O N N C C C C C C C C C C C C C H H H H H H H H H H H H H H H H H H
charge: -0.009511 -0.042465 0.114152 -0.241657 -0.030932 -0.045488 -0.330819 -0.379980 -0.373431 -0.364390 -0.661592 -0.703649 -0.395428 -0.284926 0.269118 -0.253217 -0.052649 -0.337665 -0.071819 0.211239 0.208431 0.216515 0.195445 0.234364 0.240454 0.196816 0.192032 0.283815 0.251664 0.263026 0.257534 0.218351 0.217081 0.226343 0.227220 0.288084 0.267934
chargesum: 0.00000
title: Mulliken charges with hydrogens summed into heavy atoms:
elementType: Cl Cl S O N N C C C C C C C C C C C C C
charge: -0.009511 -0.042465 0.114152 -0.241657 -0.030932 -0.045488 0.088850 0.031981 0.101387 0.024458 -0.126113 -0.183089 0.040004 0.168637 0.269118 -0.253217 0.235435 -0.069732 -0.071819
polarizability: 2.71022189e+02 -1.00970907e+01 1.92430966e+02 2.21119059e+00 3.36944494e+00 1.28674643e+02
1716.lowfreq: -13.6353 -1.9841 -0.0020 -0.0014 0.0013 2.8763 9.4162 19.8106 23.4034
frequency: -3.0243 18.1507 23.2626 39.5579 61.9451 80.2644 86.0194 106.6048 124.4386 126.6322 139.7291 146.3894 158.5511 171.9372 189.9898 223.0047 289.5150 337.7647 349.0664 365.1850 371.7477 413.0636 444.0120 450.5957 455.1776 472.2612 518.3699 549.1124 552.1767 627.7520 631.9341 666.2220 715.7596 732.3483 734.5063 767.9172 806.0874 835.7035 839.7030 874.3989 877.7749 896.7213 904.8298 909.5225 941.3847 955.5364 993.6781 1013.3748 1018.7060 1038.4208 1052.5945 1080.3057 1093.2724 1096.3568 1103.7405 1122.4387 1145.3809 1158.6701 1202.6242 1219.2839 1223.3941 1237.5622 1250.5566 1254.8772 1266.1382 1278.3060 1288.3216 1299.4835 1304.4311 1310.2647 1323.6622 1336.1408 1347.6131 1359.7104 1371.6507 1376.0278 1428.2518 1451.2891 1454.3508 1464.7917 1467.8581 1469.4067 1476.4964 1482.1995 1490.6818 1527.6151 1561.9324 2904.2662 2958.0519 2979.4104 2993.1656 3001.3104 3002.4732 3009.2783 3021.9341 3031.5130 3043.6763 3054.2743 3060.1370 3077.2160 3079.1538 3108.6270 3149.0934 3162.8643 3182.2965
redmass: 5.6149 7.1156 6.8674 7.0718 3.1540 2.6088 3.3742 4.5684 4.3028 2.0621 3.6477 4.5744 2.9676 4.2850 10.4799 3.8698 4.7957 4.7341 9.3096 3.5667 5.6404 3.9073 3.7018 4.7357 4.9841 3.2180 5.0340 3.8079 5.3994 9.3641 5.0147 3.0093 10.2280 7.4192 1.0815 1.1201 2.6781 7.1575 1.2221 1.8014 1.4044 1.3773 1.6477 3.0156 8.4902 1.2414 1.9595 4.3520 2.3710 3.7682 2.6115 2.1920 2.3882 2.2276 2.1691 1.4390 1.4592 1.2176 1.3098 1.7228 1.3594 1.2704 1.2450 1.4292 3.6928 1.1372 1.0937 1.3351 1.2236 1.4619 3.9716 1.3705 1.7506 2.2004 1.7604 1.4389 2.6411 1.0941 1.0818 1.0835 1.0718 1.0968 1.1036 1.0994 1.1010 8.9609 7.5528 1.0684 1.0588 1.0616 1.0599 1.0573 1.0974 1.0607 1.0916 1.0584 1.1029 1.1040 1.0578 1.1076 1.1031 1.1092 1.1116 1.0932 1.0943
irintensity: 0.4281 0.5527 0.0243 0.6455 0.1659 0.4871 0.9907 0.2602 2.4768 0.0610 1.4612 2.0192 1.6339 3.9646 0.1936 4.5438 5.0351 5.1576 0.0115 5.8171 2.3478 23.9980 1.9304 0.3419 12.6196 1.6306 13.1568 4.6567 5.8890 11.5599 48.5106 12.6407 86.2259 11.7456 11.9024 0.0947 12.0631 20.1702 0.2541 6.1413 27.5799 6.3734 10.7671 7.6902 58.2707 0.9484 8.5800 95.2272 20.3365 50.5709 52.5094 7.0497 8.1816 28.9399 5.2073 7.9933 3.3185 4.7417 18.6218 0.8479 22.6102 6.9590 2.1699 3.6641 246.6379 4.6840 0.6162 4.2000 2.8724 35.5374 11.9050 9.9684 88.1905 53.8968 31.8901 2.1285 341.4360 8.4345 10.3501 4.3565 1.9054 0.0701 3.8932 1.5701 14.8337 10.1780 46.2666 37.1055 17.3148 23.8501 8.5107 39.8210 11.4804 38.1999 9.1323 35.4880 4.4855 39.6652 28.6614 69.3570 26.7842 28.2871 12.7736 6.6616 0.7846
temp: 298.150 k
press: 1.00000 atm
elementType: 17 17 16 8 7 7 6 6 6 6 6 6 6 6 6 6 6 6 6 1 1 1 1 1 1 1 1 1 1 1 1 1 1 1 1 1 1
symmnumber: 1
zpe: 767064.8 jmol-1
zpe.correction: 0.292160 hartree
zpe.thermalcorrener: 0.311508 hartree
zpe.thermalcorrenthalpy: 0.312452 hartree
zpe.thermalcorrgfe: 0.240795 hartree
zpe.sumelectzpe: -2007.604364 hartree
zpe.sumelectthermal: -2007.585015 hartree
zpe.sumelectthermalent: -2007.584071 hartree
zpe.sumelectthermalfe: -2007.655729 hartree
dipole: -0.5118 -0.9355 -2.2059
dipole: 2.4502
quadrupole: -148.1668 -135.9722 -137.5935
quadrupole: 1.3751 16.6325 4.6319
quadrupole: -7.5893 4.6053 2.9840 1.3751 16.6325 4.6319
hfenergy: -2007.8965236 hartree
pointgroup: C01 [X(C13H18Cl2N2O1S1)]
dipole: -0.2171464 -0.6292106 -0.6972691 debye
polarizability: 271.1439124|-9.3642692|187.8312601|2.4885025|-16.722221|133.152625 unknown
InChI: InChI=1S/C13H18Cl2N2OS/c14-11-8-12(15)13(16-9-11)18-6-3-1-2-4-17-5-7-19-10-17/h8-9H,1-7,10H2
charge 0 multiplicity 1
37 atoms
Cl 4.130778 2.672507 -0.726498
Cl 7.537407 -1.501404 0.721273
S  -6.897896 0.035923 1.841835
O  2.029533 0.559037 -0.239767
N  -5.458061 0.233448 -0.525436
N  3.482264 -1.209686 0.371714
C  -4.207195 -0.531969 -0.24733
C  -2.942447 0.328093 -0.439096
C  -6.635473 -0.608271 -0.846533
C  -1.647513 -0.461508 -0.143516
C  -5.863646 1.131753 0.527812
C  -7.191965 -1.244948 0.473912
C  -0.380043 0.403841 -0.332127
C  0.893507 -0.385851 -0.031141
C  3.297815 0.076614 -0.017149
C  4.400204 0.961054 -0.205823
C  5.703591 0.494893 0.015583
C  4.74455 -1.676911 0.590339
C  5.86842 -0.850406 0.420964
H  -4.22159 -0.95835 0.783686
H  -4.174938 -1.381004 -0.95604
H  -2.928525 0.712209 -1.477194
H  -2.984177 1.214939 0.224709
H  -7.415134 0.038145 -1.289779
H  -6.361653 -1.379389 -1.586681
H  -1.681968 -0.851201 0.895222
H  -1.595759 -1.348177 -0.809463
H  -6.569563 1.893851 0.1677
H  -5.017718 1.584592 1.061643
H  -8.271416 -1.450431 0.3988
H  -6.653629 -2.169802 0.738368
H  -0.333627 0.785907 -1.369687
H  -0.423112 1.286864 0.33379
H  1.024336 -1.251418 -0.706893
H  0.925997 -0.754284 1.01108
H  6.563365 1.15522 -0.122144
H  4.842984 -2.720677 0.902571
